{"text_format":"1","workbook":"xlsx","n_sheets":19,"sheets":["Anleitung","Januar","Februar","März","April","Mai","Juni","Juli","August","September","Oktober","November","Dezember","mW-HO","HomeOffice","Feiertage","Test","Help","Historie"],"not_rendered":{"charts":0,"images":0,"macros":1,"external_links":0,"defined_names":22,"comments":13,"pivot_tables":0},"unopened":[],"bounds":{"document_bytes":16777216,"sheet_cells":100000,"rows_first":2000,"rows_last":500,"rows_between":2000,"halvings":0,"cell_chars":16384,"cell_head_chars":4096},"cells_cut":0,"cells_raw":0,"read":"whole","date_system":"1900"}

{"sheet":"Anleitung","index":0,"n_rows":129,"n_cols":23,"rows_kept":129,"cut":false,"hidden":false,"merged":[[49,15,49,18],[49,19,49,22],[127,2,127,4],[47,3,47,4],[39,0,39,1],[40,0,40,1],[45,5,45,6]]}
[{"$f":"\"Excel-Tool für die Erfassung der Arbeitszeit von Vollzeitkräften am Standort Mch-P; Version: \" & Version_Freigabe","v":"Excel-Tool für die Erfassung der Arbeitszeit von Vollzeitkräften am Standort Mch-P; Version: 2026.1"}]
[]
[]
[]
[]
[]
[]
[]
[]
[]
[]
[]
[]
[]
[]
[]
[]
[]
[]
[]
[]
[]
[]
[]
[]
[]
[]
[]
[]
[]
[]
[]
[]
[]
[]
[]
[]
[]
[]
["14;45",null,"Gesamtsaldo"]
["01:00:00",null,"Dieser Monat"]
[]
[]
[]
[]
[null,null,"Anwesenheitsliste",null,2026,"Report HO/mW Stat.:",null,"Nein","Monat:","Januar",null,null,"Vertragliche regelmäßige Wochenarbeitszeit: ","\"hh:mm\"",1.4583333333333333]
[null,null,null,null,null,null,null,null,null,null,null,null,null,"oder: Industrieminuten \"hh,<1/10 h>\"",null,"Std/Woche"]
[null,null,"Name:","Mustermann",null,"Vorname:","Vorname:","Klaus",null,"Personal-Nr.:",null,540000,null,null,1.4583333333333333,"Mittagspause"]
[null,null,null,null,null,null,null,null,null,null,null,"Mittagspause JA/NEIN ",null,null,"JA","00:35:00"]
[null,"Soll","Datum","Kommen","Gehen","Anwesenh.","Gesamtzeit","Mittag","Arbeitszeit","Stunden","Bemerkungen",null,"Dienstl./Sonstige Abwesenheit",null,null,"Dokumentation sonstige Abwesenheit",null,null,null,"zusätzliche Reisezeit"]
["Do","Std","Tag","08:00:00",{"$f":"D51+I51+H51","v":"16:35:00"},"abs. u. TZ","10:00:00","00:35:00","08:00:00","Saldo",null,"Hinweise","FT/U/GT/SD/K","SAR","Korrektur","von","bis","von","bis","von","bis","von","bis"]
["Fr","00:00:00","1994-12-31",null,null,null,"00:00:00","00:35:00"," ","     ---   "," "," ","FT",null,"00:00:00"]
["Sa","00:00:00","1995-01-01",null,null,null,"00:00:00","00:35:00"," ","     ---   "," "," ",null,null,"00:00:00"]
["So","00:00:00","1995-01-02",null,null,null,"00:00:00","00:35:00"," ","     ---   "," "," ",null,null,"00:00:00"]
["Mo","07:00:00","1995-01-03","08:00:00","15:35:00",null,"07:00:00","00:35:00","07:00:00",-4.1666666666666685E-2," "," ",null,null,"00:00:00"]
["Di","07:00:00","1995-01-04","08:00:00","17:00:00",null,"08:25:00","00:35:00","08:25:00","00:25:00"," "," ",null,null,"00:00:00"]
["Mi","00:00:00","1995-01-05",null,null,null,"00:00:00","00:35:00"," ","     ---   "," "," ",null,null,"00:00:00"]
["Do","07:00:00","1995-01-06","05:00:00","14:00:00",null,"08:25:00","00:35:00","08:25:00","00:25:00"," "," ",null,null,"00:00:00"]
["Fr","07:00:00","1995-01-07","06:00:00","18:00:00",null,"10:55:00","00:35:00","09:55:00",0.12152777777777785,"->Pause<-"," ",null,"ja",{"$f":"(U59-T59)-(Q59-P59)","v":-2.0833333333333259E-2},"15:00:00","16:30:00",null,null,"19:00:00","20:00:00"]
["Sa","00:00:00","1995-01-08",null,null,null,"00:00:00","00:35:00"," ","     ---   "," "," ",null,null,"00:00:00"]
["So","00:00:00","1995-01-09",null,null,null,"00:00:00","00:35:00"," ","     ---   "," "," ",null,null,"00:00:00"]
["Mo","07:00:00","1995-01-10","10:00:00","20:15:00",null,"09:40:00","00:35:00","09:40:00","01:40:00","->Pause<-"," ",null,null,"01:00:00"]
["Di","07:00:00","1995-01-11",null,null,null,"00:00:00","00:35:00"," ","     ---   "," "," ",null,null,"00:00:00"]
["Mi","07:00:00","1995-01-12","08:00:00","14:00:00",null,"05:25:00","00:35:00","05:25:00",-0.10763888889999999," "," ",null,null,"00:00:00"]
["Do","07:00:00","1995-01-13","06:00:00","16:40:00",null,"09:05:00","00:35:00","09:05:00","01:05:00","->Pause<-","Arbeitszeit >10 Std.",null,null,"00:00:00"]
["Fr","07:00:00","1995-01-14",null,null,null,"00:00:00","00:35:00",null,null," "," ",null,null,"00:00:00"]
["Sa","00:00:00","1995-01-15",null,null,null,"00:00:00","00:35:00"," ","     ---   "," "," ",null,null,"00:00:00"]
["So","00:00:00","1995-01-16",null,null,null,"00:00:00","00:35:00"," ","     ---   "," "," ",null,null,"00:00:00"]
["Mo","07:00:00","1995-01-17",null,null,null,"00:00:00","00:35:00",null,"     ---   "," "," ",null,null,"00:00:00"]
["Di","07:00:00","1995-01-18",null,null,null,"00:00:00","00:35:00"," ","     ---   "," "," ","U",null,"00:00:00"]
["Mi","07:00:00","1995-01-19","07:00:00","13:00:00",null,"04:25:00","00:35:00","04:25:00",-0.1493055556," "," ",null,"ja",-4.1666666666666699E-2,"13:00:00","14:00:00"]
["Do","07:00:00","1995-01-20",null,null,null,"00:00:00","00:35:00"," ","     ---   "," "," ",null,null,"00:00:00"]
["Fr","07:00:00","1995-01-21",null,null,null,"00:00:00","00:35:00"," ","     ---   "," "," ",null,null,"00:00:00"]
["Sa","00:00:00","1995-01-22",null,null,null,"00:00:00","00:35:00"," ","     ---   "," "," ",null,null,"00:00:00"]
["So","00:00:00","1995-01-23",null,null,null,"00:00:00","00:35:00"," ","     ---   "," "," ",null,null,"00:00:00"]
["Mo","07:00:00","1995-01-24",null,null,null,"00:00:00","00:35:00"," ","     ---   "," "," ",null,null,"00:00:00"]
["Di","07:00:00","1995-01-25","08:00:00","18:00:00",null,"09:15:00","00:45:00","09:15:00","01:15:00"," "," ",null,null,"00:00:00"]
["Mi","07:00:00","1995-01-26",null,null,null,"00:00:00","00:35:00"," ","     ---   "," "," ",null,null,"00:00:00"]
["Do","07:00:00","1995-01-27",null,null,null,"00:00:00","00:35:00"," ","     ---   "," "," ",null,null,"00:00:00"]
["Fr","07:00:00","1995-01-28",null,null,null,"00:00:00","00:35:00"," ","     ---   "," "," ",null,null,"00:00:00"]
["Sa","00:00:00","1995-01-29",null,null,null,"00:00:00","00:35:00"," ","     ---   "," "," ",null,null,"00:00:00"]
["So","00:00:00","1995-01-30",null,null,null,"00:00:00","00:35:00"," ","     ---   "," "," ",null,null,"00:00:00"]
[null,null,null,null,null,null,null,null,null,4.5138888888888888E-2,"Mon.saldo",4.5138888888888888E-2]
[null,null,null,null,null,null,null,null,null,"+ Saldo / Vormonate"]
[null,null,null,null,null,null,null,null,null,"- Auszahlungen",null,0]
[null,null,null,null,null,null,null,null,null,"Gesamtsaldo",null,4.5138888888888888E-2]
[]
[null,null,"Vorgesetzten-",null,2006,null,null,null,"Monat:",null,null,null,null,"Vertragliche regelmäßige Wochenarbeitszeit: ",35,"Std/Woche"]
[null,null,"Meldung",null,null,null,null,null,null,"Januar"]
[null,null,"Name:","Mustermann",null,"Vorname:","Vorname:","Klaus"]
[null,null,null,null,null,null,null,null,null,"Personal-Nr.:",null,540000,null,"Bemerkungen"]
[null,null,"Datum","Kommen","Gehen","Anwesenh.","Anwesenh.","Mittag","Arbeitszeit","Stunden","Bemerkungen"]
[null,null,"Tag","08:05:00","15:40:00","abs. u. TZ","10:00:00","00:35:00","07:00:00","Saldo",null,"Hinweise","U/KE/SD"]
["Fr","00:00:00","1994-12-31"," "," "," "," ",null,null,null," "," "]
["Sa","00:00:00","1995-01-01"," "," "," "," ",null,null,null," "," "," "]
["So","00:00:00","1995-01-02"," "," "," "," ",null,null,null," "," "," "]
["Mo","07:00:00","1995-01-03"," "," "," "," ",null,null,null," "," "," "]
["Di","07:00:00","1995-01-04"," "," "," "," ",null,null,null," "," "," "]
["Mi","00:00:00","1995-01-05"," "," "," "," ",null,null,null," "," "," "]
["Do","07:00:00","1995-01-06","05:00:00"," "," "," ",null,null,null," ",{"$f":"IF(ISERROR(VLOOKUP(C100,Feiertage,2,FALSE))=TRUE,IF(E100<>\" \",\"Kommen/Gehen vor/nach 06:30/20:00\",IF(D100<>\" \",\"Kommen/Gehen vor/nach 06:30/20:00\",\" \")),VLOOKUP(C100,Feiertage,2,FALSE))","v":"Kommen/Gehen vor/nach 06:30/20:00"}," "]
["Fr","07:00:00","1995-01-07","06:00:00"," "," ",null,"Pause!",null,null,null,"Kommen/Gehen vor/nach 06:30/20:00"," "]
["Sa","00:00:00","1995-01-08"," "," "," "," ",null,null,null,null," "," "]
["So","00:00:00","1995-01-09"," "," "," "," ",null,null,null,null," "," "]
["Mo","07:00:00","1995-01-10"," ",null," "," ","Pause!",null,null,null,null," "]
["Di","07:00:00","1995-01-11"," ","20:15:00"," "," ",null,{"$f":"IF(L62=\"->Pause<-\",\"Pause!\",\"\")","v":""},null," ",{"$f":"IF(ISERROR(VLOOKUP(C105,Feiertage,2,FALSE))=TRUE,IF(E105<>\" \",\"Kommen/Gehen vor/nach 06:30/20:00\",IF(D105<>\" \",\"Kommen/Gehen vor/nach 06:30/20:00\",\" \")),VLOOKUP(C105,Feiertage,2,FALSE))","v":"Kommen/Gehen vor/nach 06:30/20:00"}]
["Mi","07:00:00","1995-01-12"," "," "," "," ",null,null,null," "," "," "]
["Do","07:00:00","1995-01-13","06:00:00"," "," "," ","Pause!",null,null,{"$f":"IF(G101<>\" \",\"AZ > 10 h\",\" \")","v":"AZ > 10 h"},{"$f":"IF(ISERROR(VLOOKUP(C107,Feiertage,2,FALSE))=TRUE,IF(E107<>\" \",\"Kommen/Gehen vor/nach 06:30/20:00\",IF(D107<>\" \",\"Kommen/Gehen vor/nach 06:30/20:00\",\" \")),VLOOKUP(C107,Feiertage,2,FALSE))","v":"Kommen/Gehen vor/nach 06:30/20:00"}," "]
["Fr","07:00:00","1995-01-14"," "," "," "," ",null,null,null," "," "," "]
["Sa","00:00:00","1995-01-15"," "," "," "," ",null,null,null," "," "," "]
["So","00:00:00","1995-01-16"," "," "," "," ",null,null,null," "," "," "]
["Mo","07:00:00","1995-01-17"," "," "," "," ",null,null,null," "," "," "]
["Di","07:00:00","1995-01-18"," "," "," "," ",null,null,null," "," "]
["Mi","07:00:00","1995-01-19"," "," "," "," ",null,null,null," "," "," "]
["Do","07:00:00","1995-01-20"," "," "," "," ",null,null,null," "," "," "]
["Fr","07:00:00","1995-01-21"," "," "," "," ",null,null,null," "," "," "]
["Sa","00:00:00","1995-01-22"," "," "," "," ",null,null,null," "," "," "]
["So","00:00:00","1995-01-23"," "," "," "," ",null,null,null," "," "," "]
["Mo","07:00:00","1995-01-24"," "," "," "," ",null,null,null," "," "," "]
["Di","07:00:00","1995-01-25"," "," "," "," ",null,null,null," "," "," "]
["Mi","07:00:00","1995-01-26"," "," "," "," ",null,null,null," "," "," "]
["Do","07:00:00","1995-01-27"," "," "," "," ",null,null,null," "," "," "]
["Fr","07:00:00","1995-01-28"," "," "," "," ",null,null,null," "," "," "]
["Sa","00:00:00","1995-01-29"," "," "," "," ",null,null,null," "," "," "]
["So","00:00:00","1995-01-30"," "," "," "," ",null,null,null," "," "," "]
[null,null,"Meldegründe:",null,null,null,null,null,null,null,"Mon.saldo"]
[null,null,"vor","06:30:00",null,null,"Über 60 Stunden",2.5,"Gesamtsaldo","+ Saldo / Vormonate"]
[null,null,"nach ","20:00:00",null,null,"Über","10:00:00","Std. tägl.","- Auszahlungen",null,{"$f":"L84","v":0}]
[{"$f":"Januar!A87","v":"V 2026.1"},null,{"$f":"\"%mobile Work / Telearbeit: \"&IF(H46=\"Ja\",\"15%\",\"n.a.\")","v":"%mobile Work / Telearbeit: n.a."},null,null,null,"unter -20 Stunden",-0.83333333333333337,"Gesamtsaldo","Gesamtsaldo",null," "]
[null,null,null,null,null,null,null,null,null,null,null," "]

{"sheet":"Januar","index":1,"n_rows":88,"n_cols":27,"rows_kept":88,"cut":false,"hidden":false,"merged":[[7,19,7,22],[7,15,7,18],[86,2,86,4],[6,11,6,13],[0,0,0,1],[1,0,1,1],[5,7,5,8],[48,3,48,4],[48,7,48,8],[5,3,5,4],[3,5,3,6]]}
[{"$f":"L44","v":-0.19097222222222227},null,"Gesamtsaldo",null,null,null,null,null,null,null,null,null,null,null,null,"Tages-","Mo",{"$f":"$O$4/5","v":0.25},null,null,null,null,null,null,"Hilfsspalte","Urlaubstage"]
[{"$f":"L41","v":-0.19097222222222227},null,"Dieser Monat",null,null,null,null,null,null,null,null,null,null,null,null,"arbeitszeit","Di",{"$f":"$O$4/5","v":0.25}]
[null,null,null,null,null,null,null,null,null,null,null,null,null,null,null,null,"Mi",0.25]
[null,null,"Anwesenheitsliste",null,"2021-12-31","Report HO/mW Stat.:",null,"Ja","Monat:",{"$f":"VLOOKUP(MONTH(C10),Text_Monatsname,2,FALSE)","v":"Januar"},null,null,"Vertragliche regelmäßige Wochenarbeitszeit: ","\"hh:mm\"",1.25,null,"Do",0.25,null,null,null,null,null,null,{"$f":"Y5*Y6","v":1.25}]
[null,null,null,null,null,null,null,null,null,null,null,null,null,"oder: Industrieminuten \"hh,<1/10 h>\"",null,"Std/Woche","Fr",0.25,{"$f":"SUM(R1:R7)","v":1.25},null,null,null,null,null,{"$f":"IF(O4<>\"\",IF(O5=\"\",(DAY(O4)*24-24)+HOUR(O4)+MINUTE(O4)/60,IF(O5*Y6=O4,O5,\"Fehler\")),IF(O5<>\"\",O5,\"Fehler\"))","v":30}]
[null,null,"Name:",null,null,null,"Vorname:",null,null,"Pers.-Nr.:",null,"Abteilung/Kostenstelle:",null,null,{"$f":"IF(Y5=\"Fehler\",\"nur ein Wert!\",\"\")","v":""},"Mittagspause","Sa",0,{"$f":"IF(Y4=S5,\"Saldo O.K.\",\"Saldo falsch\")","v":"Saldo O.K."},null,null,null,null,null,"01:00:00"]
[null,null,null,null,null,null,null,null,null,null,null,"Mittagspause (Ja / Nein)  ",null,null,"Ja","00:35:00","So",0]
[null,"Soll","Datum","Kommen","Gehen","Anwesenh.","Gesamtzeit","Mittag","Arbeitszeit","Stunden","Bemerkungen",null,"Dienstl./Sonstige Abwesenheit",null,null,"Dokumentation sonstige Abwesenheit",null,null,null,"zusätzliche Reisezeit"]
[null,"Std","Tag","08:00:00",{"$f":"D9+I9+H9","v":"14:35:00"},"abs. u. TZ","10:00:00",{"$f":"IF(O7=\"NEIN\",0,P7)","v":"00:35:00"},{"$f":"Y4/5","v":"06:00:00"},"Saldo",null,"Hinweise","FT/U/GT/SD/K","SAR","Korrektur","von","bis","von","bis","von","bis","von","bis",null,null,{"$f":"VLOOKUP(J4,Werte_UrlaubstageProMonat,2,FALSE)","v":0}]
[{"$f":"VLOOKUP(WEEKDAY(C10,2),Text_Wochentag,2)","v":"Do"},{"$f":"IF(OR(A10=\"Sa\",A10=\"So\"),\"0:00\",IF(Y10=\"FT\",\"0:00\",$I$9))","v":"06:00:00"},{"$f":"E4","v":"2021-12-31"},"00:00:00","00:00:00",null,{"$f":"IF(I10=\" \",0,I10 + IF(N10=\"Ja\", (U10-T10) + (W10-V10),0))","v":"00:00:00"},{"$f":"$H$9","v":"00:35:00"},{"$f":"IFERROR(IF(E10=0,IF(D10=0,\" \",E10-D10+F10-H10),TIME(HOUR(E10-D10+F10),MINUTE(E10-D10+F10),0)-H10) - IF(N10=\"Ja\",(Q10-P10) + (S10-R10),0),\" \")","v":" "},{"$f":"IF(Y10=\"GT\",-B10,IF(E10>0,G10-B10,IF(F10>0,G10-B10,\"     ---   \")))","v":"     ---   "},{"$f":"IF(G11<0,$I$9+D11+H11+O11, IFERROR(IF(OR(AND((I11*24)>9,((H11+IF(N11=\"Ja\",(Q11-P11)+(S11-R11),0))*24*60)<45),AND((I11*24)>6,((H11+IF(N11=\"Ja\",(Q11-P11)+(S11-R11),0))*24*60)<30)),\"->Pause<-\",\"\"),\"\"))","v":""},{"$f":"IF(ISERROR(VLOOKUP(C10,Feiertage,2,FALSE))=TRUE,IF(G10<0,\"Uhr  mind. Arbeitszeit\",IF(AND(I10<>\" \",I10>$G$9),\"Arbeitszeit >10 Std.\",\" \")),VLOOKUP(C10,Feiertage,2,FALSE))","v":"Neujahr"},"U",null,{"$f":"IF(N10=\"Ja\",((U10-T10)+(W10-V10))-((Q10-P10)+(S10-R10)),0)","v":0},null,null,null,null,null,null,null,null,null,{"$f":"UPPER(TRIM(M10))","v":"U"},{"$f":"IF(AA10=\"\",\"\",MAX(Z$9:Z9)+1)","v":1},{"$f":"IF(M10=\"U\",C10,\"\")","v":"2021-12-31"}]
[{"$f":"VLOOKUP(WEEKDAY(C11,2),Text_Wochentag,2)","v":"Fr"},{"$f":"IF(OR(A11=\"Sa\",A11=\"So\"),\"0:00\",IF(Y11=\"FT\",\"0:00\",$I$9))","v":"06:00:00"},{"$f":"C10+1","v":"2022-01-01"},"00:00:00","00:00:00",null,{"$f":"IF(I11=\" \",0,I11 + IF(N11=\"Ja\", (U11-T11) + (W11-V11),0))","v":"00:00:00"},{"$f":"$H$9","v":"00:35:00"},{"$f":"IFERROR(IF(E11=0,IF(D11=0,\" \",E11-D11+F11-H11),TIME(HOUR(E11-D11+F11),MINUTE(E11-D11+F11),0)-H11) - IF(N11=\"Ja\",(Q11-P11) + (S11-R11),0),\" \")","v":" "},{"$f":"IF(Y11=\"GT\",-B11,IF(E11>0,G11-B11,IF(F11>0,G11-B11,\"     ---   \")))","v":"     ---   "},{"$f":"IF(G11<0,$I$9+D11+H11+O11, IFERROR(IF(OR(AND((I11*24)>9,((H11+IF(N11=\"Ja\",(Q11-P11)+(S11-R11),0))*24*60)<45),AND((I11*24)>6,((H11+IF(N11=\"Ja\",(Q11-P11)+(S11-R11),0))*24*60)<30)),\"->Pause<-\",\"\"),\"\"))","v":""}," ","U",null,{"$f":"IF(N11=\"Ja\",((U11-T11)+(W11-V11))-((Q11-P11)+(S11-R11)),0)","v":0},null,null,null,null,null,null,null,null,null,{"$f":"UPPER(TRIM(M11))","v":"U"},{"$f":"IF(AA11=\"\",\"\",MAX(Z$9:Z10)+1)","v":2},{"$f":"IF(M11=\"U\",C11,\"\")","v":"2022-01-01"}]
["Sa","0:00",{"$f":"C11+1","v":"2022-01-02"},"00:00:00","00:00:00",null,"00:00:00","00:35:00"," ","     ---   ",{"$f":"IF(G12<0,$I$9+D12+H12+O12, IFERROR(IF(OR(AND((I12*24)>9,((H12+IF(N12=\"Ja\",(Q12-P12)+(S12-R12),0))*24*60)<45),AND((I12*24)>6,((H12+IF(N12=\"Ja\",(Q12-P12)+(S12-R12),0))*24*60)<30)),\"->Pause<-\",\"\"),\"\"))","v":""}," ",null,null,0,null,null,null,null,null,null,null,null,null,"",{"$f":"IF(AA12=\"\",\"\",MAX(Z$9:Z11)+1)","v":""},""]
["So","0:00","2022-01-03","00:00:00","00:00:00",null,"00:00:00","00:35:00"," ","     ---   ",""," ",null,null,0,null,null,null,null,null,null,null,null,null,"",{"$f":"IF(AA13=\"\",\"\",MAX(Z$9:Z12)+1)","v":""},""]
["Mo","06:00:00","2022-01-04","09:00:00","15:35:00",null,"06:00:00","00:35:00",0.25,0,""," ","U",null,0,null,null,null,null,null,null,null,null,null,"U",{"$f":"IF(AA14=\"\",\"\",MAX(Z$9:Z13)+1)","v":3},"2022-01-04"]
["Di","06:00:00","2022-01-05","09:00:00","15:35:00",null,"06:00:00","00:35:00",{"$f":"IFERROR(IF(E15=0,IF(D15=0,\" \",E15-D15+F15-H15),TIME(HOUR(E15-D15+F15),MINUTE(E15-D15+F15),0)-H15) - IF(N15=\"Ja\",(Q15-P15) + (S15-R15),0),\" \")","v":0.25},0,"","Heilige drei Könige",null,null,0,null,null,null,null,null,null,null,null,null,"",{"$f":"IF(AA15=\"\",\"\",MAX(Z$9:Z14)+1)","v":""},""]
["Mi","06:00:00","2022-01-06","08:15:00","15:35:00",null,"06:45:00","00:35:00",{"$f":"IFERROR(IF(E16=0,IF(D16=0,\" \",E16-D16+F16-H16),TIME(HOUR(E16-D16+F16),MINUTE(E16-D16+F16),0)-H16) - IF(N16=\"Ja\",(Q16-P16) + (S16-R16),0),\" \")","v":0.28125},3.125E-2,""," ",null,null,0,null,null,null,null,null,null,null,null,null,"",{"$f":"IF(AA16=\"\",\"\",MAX(Z$9:Z15)+1)","v":""},""]
["Do","06:00:00","2022-01-07","07:45:00","15:00:00",null,"06:40:00","00:35:00",0.27777777777777773,2.7777777777777735E-2,""," ",null,null,0,null,null,null,null,null,null,null,null,null,"",{"$f":"IF(AA17=\"\",\"\",MAX(Z$9:Z16)+1)","v":""},""]
["Fr","06:00:00","2022-01-08",3.3333333333333335,"15:00:00",null,"00:00:00","00:35:00"," ",-0.25,""," ",null,null,0,null,null,null,null,null,null,null,null,null,"",{"$f":"IF(AA18=\"\",\"\",MAX(Z$9:Z17)+1)","v":""},""]
["Sa","0:00","2022-01-09","00:00:00","00:00:00",null,"00:00:00","00:35:00"," ","     ---   ",""," ",null,null,0,null,null,null,null,null,null,null,null,null,"",{"$f":"IF(AA19=\"\",\"\",MAX(Z$9:Z18)+1)","v":""},""]
["So","0:00","2022-01-10","00:00:00","00:00:00",null,"00:00:00",{"$f":"$H$9","v":"00:35:00"}," ","     ---   ",""," ",null,null,0,null,null,null,null,null,null,null,null,null,"",{"$f":"IF(AA20=\"\",\"\",MAX(Z$9:Z19)+1)","v":""},""]
["Mo","06:00:00","2022-01-11","00:00:00","00:00:00",null,"00:00:00","00:35:00"," ","     ---   ",""," ",null,null,0,null,null,null,null,null,null,null,null,null,"",{"$f":"IF(AA21=\"\",\"\",MAX(Z$9:Z20)+1)","v":""},""]
["Di","06:00:00","2022-01-12","00:00:00","00:00:00",null,"00:00:00","00:35:00"," ","     ---   ",""," ",null,null,0,null,null,null,null,null,null,null,null,null,"",{"$f":"IF(AA22=\"\",\"\",MAX(Z$9:Z21)+1)","v":""},""]
["Mi","06:00:00","2022-01-13","00:00:00","00:00:00",null,"00:00:00","00:45:00"," ","     ---   ",""," ",null,null,0,null,null,null,null,null,null,null,null,null,"",{"$f":"IF(AA23=\"\",\"\",MAX(Z$9:Z22)+1)","v":""},""]
["Do","06:00:00","2022-01-14","00:00:00","00:00:00",null,"00:00:00","00:35:00"," ","     ---   ",""," ",null,null,0,null,null,null,null,null,null,null,null,null,"",{"$f":"IF(AA24=\"\",\"\",MAX(Z$9:Z23)+1)","v":""},""]
["Fr","06:00:00","2022-01-15","00:00:00","00:00:00",null,"00:00:00","00:35:00"," ","     ---   ",""," ",null,null,0,null,null,null,null,null,null,null,null,null,"",{"$f":"IF(AA25=\"\",\"\",MAX(Z$9:Z24)+1)","v":""},""]
["Sa","0:00","2022-01-16","00:00:00","00:00:00",null,"00:00:00","00:35:00"," ","     ---   ",""," ",null,null,0,null,null,null,null,null,null,null,null,null,"",{"$f":"IF(AA26=\"\",\"\",MAX(Z$9:Z25)+1)","v":""},""]
["So","0:00","2022-01-17","00:00:00","00:00:00",null,"00:00:00","00:35:00"," ","     ---   ",""," ",null,null,0,null,null,null,null,null,null,null,null,null,"",{"$f":"IF(AA27=\"\",\"\",MAX(Z$9:Z26)+1)","v":""},""]
["Mo","06:00:00","2022-01-18","00:00:00","00:00:00",null,"00:00:00","00:35:00"," ","     ---   ",null," ","",null,0,null,null,null,null,null,null,null,null,null,"",{"$f":"IF(AA28=\"\",\"\",MAX(Z$9:Z27)+1)","v":""},""]
["Di","06:00:00","2022-01-19","00:00:00","00:00:00",null,"00:00:00","00:35:00"," ","     ---   ",""," ","",null,0,null,null,null,null,null,null,null,null,null,"",{"$f":"IF(AA29=\"\",\"\",MAX(Z$9:Z28)+1)","v":""},""]
["Mi","06:00:00","2022-01-20","00:00:00","00:00:00",null,"00:00:00","00:35:00"," ","     ---   ",""," ","",null,0,null,null,null,null,null,null,null,null,null,"",{"$f":"IF(AA30=\"\",\"\",MAX(Z$9:Z29)+1)","v":""},""]
["Do","06:00:00","2022-01-21","00:00:00","00:00:00",null,"00:00:00","00:35:00"," ","     ---   ",""," ","",null,0,null,null,null,null,null,null,null,null,null,"",{"$f":"IF(AA31=\"\",\"\",MAX(Z$9:Z30)+1)","v":""},""]
["Fr","06:00:00","2022-01-22","00:00:00","00:00:00",null,"00:00:00","00:35:00"," ","     ---   ",""," ",null,null,0,null,null,null,null,null,null,null,null,null,"",{"$f":"IF(AA32=\"\",\"\",MAX(Z$9:Z31)+1)","v":""},""]
["Sa","0:00","2022-01-23","00:00:00","00:00:00",null,"00:00:00","00:35:00"," ","     ---   ",""," ","",null,0,null,null,null,null,null,null,null,null,null,"",{"$f":"IF(AA33=\"\",\"\",MAX(Z$9:Z32)+1)","v":""},""]
["So","0:00","2022-01-24","00:00:00","00:00:00",null,"00:00:00","00:35:00"," ","     ---   ",""," ","",null,0,null,null,null,null,null,null,null,null,null,"",{"$f":"IF(AA34=\"\",\"\",MAX(Z$9:Z33)+1)","v":""},""]
["Mo","06:00:00","2022-01-25","00:00:00","00:00:00",null,"00:00:00","00:35:00"," ","     ---   ",""," ","",null,0,null,null,null,null,null,null,null,null,null,"",{"$f":"IF(AA35=\"\",\"\",MAX(Z$9:Z34)+1)","v":""},""]
["Di","06:00:00","2022-01-26","00:00:00","00:00:00",null,"00:00:00","00:45:00"," ","     ---   ",""," ",null,null,0,null,null,null,null,null,null,null,null,null,"",{"$f":"IF(AA36=\"\",\"\",MAX(Z$9:Z35)+1)","v":""},""]
["Mi","06:00:00","2022-01-27","00:00:00","00:00:00",null,"00:00:00","00:35:00"," ","     ---   ",""," ",{"$f":"IF(ISERROR(VLOOKUP(C37,Feiertage,2,FALSE))=TRUE,\"\",\"FT\")","v":""},null,0,null,null,null,null,null,null,null,null,null,"",{"$f":"IF(AA37=\"\",\"\",MAX(Z$9:Z36)+1)","v":""},""]
["Do","06:00:00","2022-01-28","00:00:00","00:00:00",null,"00:00:00","00:35:00"," ","     ---   ",""," ","",null,0,null,null,null,null,null,null,null,null,null,"",{"$f":"IF(AA38=\"\",\"\",MAX(Z$9:Z37)+1)","v":""},""]
["Fr","06:00:00","2022-01-29","00:00:00","00:00:00",null,"00:00:00","00:35:00"," ","     ---   ",""," ","",null,0,null,null,null,null,null,null,null,null,null,"",{"$f":"IF(AA39=\"\",\"\",MAX(Z$9:Z38)+1)","v":""},""]
["Sa",{"$f":"IF(OR(A40=\"Sa\",A40=\"So\"),\"0:00\",IF(Y40=\"FT\",\"0:00\",$I$9))","v":"0:00"},"2022-01-30","00:00:00","00:00:00",null,"00:00:00","00:35:00"," ","     ---   ",""," ","",null,0,null,null,null,null,null,null,null,null,null,"",{"$f":"IF(AA40=\"\",\"\",MAX(Z$9:Z39)+1)","v":""},""]
[null,null,null,null,null,null,null,null,null,{"$f":"SUM(J10:J40)","v":-0.19097222222222227},"Mon.saldo",{"$f":"J41","v":-0.19097222222222227},null,null,null,null,null,null,null,null,null,null,null,null,null,{"$f":"MAX(Z9:Z40)","v":3},{"$f":"COUNT(AA10:AA40)","v":3}]
[null,null,null,null,null,null,null,null,null,"+ Saldo / Vormonate",null,0,{"$f":"VLOOKUP($J$4,Tabelle_Kürzel_Abwesenheit,Spalte_GT_Monat,FALSE)","v":0},"Ganztäg. Zeitentnahmen lfd. Monat",null,{"$f":"VLOOKUP($J$4,Tabelle_Kürzel_Abwesenheit,Spalte_U_Monat,FALSE)","v":0},"Urlaub lfd. Monat",{"$f":"VLOOKUP($J$4,Tabelle_Kürzel_Abwesenheit,Spalte_K_Monat,FALSE)","v":0},"krank lfd. Monat"]
[null,null,null,null,null,null,null,null,null,"- Auszahlungen",null,0]
[null,null,null,null,null,null,null,null,null,"Gesamtsaldo",null,{"$f":"SUM(L41:L42)-L43","v":-0.19097222222222227},{"$f":"VLOOKUP($J$4,Tabelle_Kürzel_Abwesenheit,Spalte_GT_Summe,FALSE)","v":0},"Ganztäg. Zeitentnahmen Jahr",null,{"$f":"VLOOKUP($J$4,Tabelle_Kürzel_Abwesenheit,Spalte_U_Summe,FALSE)","v":0},"Urlaub Jahr",{"$f":"VLOOKUP($J$4,Tabelle_Kürzel_Abwesenheit,Spalte_K_Summe,FALSE)","v":0},"krank Jahr"]
[]
[]
[null,null,"Vorgesetzten-",null,{"$f":"E4","v":"2021-12-31"},null,null,null,{"$f":"I4","v":"Monat:"},{"$f":"J4","v":"Januar"},null,null,null,{"$f":"M4","v":"Vertragliche regelmäßige Wochenarbeitszeit: "},{"$f":"Y5","v":30},{"$f":"P5","v":"Std/Woche"}]
[null,null,"Meldung"]
[null,null,{"$f":"C6","v":"Name:"},{"$f":"D6","v":0},null,null,{"$f":"G6","v":"Vorname:"},{"$f":"H6","v":0},null,{"$f":"J6","v":"Pers.-Nr.:"},{"$f":"K6","v":0},"Abteilung/Kostenstelle:",{"$f":"M6","v":0}]
[null,null,null,null,null,null,null,null,null,null,null,null,null,"Bemerkungen"]
[null,null,{"$f":"C8","v":"Datum"},"Kommen","Gehen","Anwesenh.","Gesamtzeit","Mittag","Arbeitszeit","Stunden","Bemerkungen"]
[null,null,{"$f":"C9","v":"Tag"},"08:00:00","14:35:00","abs. u. TZ","10:00:00","00:35:00","06:00:00","Saldo",null,"Hinweise","FT/U/GT/SD/K"]
[{"$f":"A10","v":"Do"},"06:00:00","2021-12-31",{"$f":"IF(D10=0,\" \",IF(OR($A53=\"Sa\",$A53=\"So\",$M53=\"FT\"),D10,IF(D10<$D$85,D10,\" \")))","v":" "},{"$f":"IF(E10=0,\" \",IF(OR($A53=\"Sa\",$A53=\"So\",$M53=\"FT\"),E10,IF(E10>$D$86,E10,\" \")))","v":" "},null,{"$f":"IF(G10=0,\" \",IF(G10-H10-O10>$H$86,G10,\" \"))","v":" "},{"$f":"IF(K10=\"->Pause<-\",\"Pause!\",\"\")","v":""},null,null,{"$f":"IF(G53<>\" \",\"AZ > 10 h\",\" \")","v":" "},{"$f":"IF(ISERROR(VLOOKUP(C53,Feiertage,2,FALSE))=TRUE,IF(E53<>\" \",\"Kommen/Gehen vor/nach 06:30/20:00\",IF(D53<>\" \",\"Kommen/Gehen vor/nach 06:30/20:00\",\" \")),VLOOKUP(C53,Feiertage,2,FALSE))","v":"Neujahr"},{"$f":"IF(Y10>0,Y10,\" \")","v":"U"},null,null,null,null,null,null,null,null,null,null,null,{"$f":"Y10","v":"U"}]
["Fr","06:00:00","2022-01-01"," "," ",null," ","",null,null,{"$f":"IF(G54<>\" \",\"AZ > 10 h\",\" \")","v":" "}," ","U",null,null,null,null,null,null,null,null,null,null,null,"U"]
["Sa","0:00","2022-01-02"," "," ",null," ","",null,null," "," ","",null,null,null,null,null,null,null,null,null,null,null,""]
["So","0:00","2022-01-03"," "," ",null," ","",null,null," "," ","",null,null,null,null,null,null,null,null,null,null,null,""]
["Mo","06:00:00","2022-01-04"," "," ",null," ","",null,null," "," ","U",null,null,null,null,null,null,null,null,null,null,null,"U"]
["Di","06:00:00","2022-01-05"," "," ",null," ","",null,null,{"$f":"IF(G58<>\" \",\"AZ > 10 h\",\" \")","v":" "},"Heilige drei Könige","",null,null,null,null,null,null,null,null,null,null,null,""]
["Mi","06:00:00","2022-01-06"," "," ",null," ","",null,null," "," ","",null,null,null,null,null,null,null,null,null,null,null,""]
["Do","06:00:00","2022-01-07"," "," ",null," ","",null,null," "," ","",null,null,null,null,null,null,null,null,null,null,null,""]
["Fr","06:00:00","2022-01-08"," ",null,null," ","",null,null," ",null,"",null,null,null,null,null,null,null,null,null,null,null,""]
["Sa","0:00","2022-01-09"," "," ",null," ","",null,null," "," ","",null,null,null,null,null,null,null,null,null,null,null,""]
["So","0:00","2022-01-10"," "," ",null," ","",null,null," "," ","",null,null,null,null,null,null,null,null,null,null,null,""]
["Mo","06:00:00","2022-01-11"," "," ",null," ","",null,null," "," ","",null,null,null,null,null,null,null,null,null,null,null,""]
["Di","06:00:00","2022-01-12"," "," ",null," ","",null,null," "," ","",null,null,null,null,null,null,null,null,null,null,null,""]
["Mi","06:00:00","2022-01-13"," "," ",null," ","",null,null," "," ","",null,null,null,null,null,null,null,null,null,null,null,""]
["Do","06:00:00","2022-01-14"," "," ",null," ","",null,null," "," ","",null,null,null,null,null,null,null,null,null,null,null,""]
["Fr","06:00:00","2022-01-15"," "," ",null," ","",null,null," "," ","",null,null,null,null,null,null,null,null,null,null,null,""]
["Sa","0:00","2022-01-16"," "," ",null," ","",null,null," "," ","",null,null,null,null,null,null,null,null,null,null,null,""]
["So","0:00","2022-01-17"," "," ",null," ","",null,null," "," ","",null,null,null,null,null,null,null,null,null,null,null,""]
["Mo","06:00:00","2022-01-18"," "," ",null," ","",null,null," "," ","",null,null,null,null,null,null,null,null,null,null,null,""]
["Di","06:00:00","2022-01-19"," "," ",null," ","",null,null," "," ","",null,null,null,null,null,null,null,null,null,null,null,""]
["Mi","06:00:00","2022-01-20"," "," ",null," ","",null,null," "," ","",null,null,null,null,null,null,null,null,null,null,null,""]
["Do","06:00:00","2022-01-21"," "," ",null," ","",null,null," "," ","",null,null,null,null,null,null,null,null,null,null,null,""]
["Fr","06:00:00","2022-01-22"," "," ",null," ","",null,null," "," ","",null,null,null,null,null,null,null,null,null,null,null,""]
["Sa","0:00","2022-01-23"," "," ",null," ","",null,null," "," ","",null,null,null,null,null,null,null,null,null,null,null,""]
["So","0:00","2022-01-24"," "," ",null," ","",null,null," "," ","",null,null,null,null,null,null,null,null,null,null,null,""]
["Mo","06:00:00","2022-01-25"," "," ",null," ","",null,null," "," ","",null,null,null,null,null,null,null,null,null,null,null,""]
["Di","06:00:00","2022-01-26"," "," ",null," ","",null,null," "," ","",null,null,null,null,null,null,null,null,null,null,null,""]
["Mi","06:00:00","2022-01-27"," "," ",null," ","",null,null," "," ","",null,null,null,null,null,null,null,null,null,null,null,""]
["Do","06:00:00","2022-01-28"," "," ",null," ","",null,null," "," ","",null,null,null,null,null,null,null,null,null,null,null,""]
["Fr","06:00:00","2022-01-29"," "," ",null," ","",null,null," "," ","",null,null,null,null,null,null,null,null,null,null,null,""]
["Sa","0:00","2022-01-30"," "," ",null," ","",null,null," "," ","",null,null,null,null,null,null,null,null,null,null,null,""]
[null,null,"Meldegründe:",null,null,null,null,null,null,null,{"$f":"K41","v":"Mon.saldo"}]
[null,null,"vor","06:30:00",null,null,"Über 60 Stunden",{"$f":"H86*6","v":2.5},"Gesamtsaldo",{"$f":"J42","v":"+ Saldo / Vormonate"},null,null,{"$f":"M42","v":0},{"$f":"N42","v":"Ganztäg. Zeitentnahmen lfd. Monat"}]
[null,null,"nach ","20:00:00",null,null,"Über",{"$f":"G9","v":"10:00:00"},"Std. tägl.","- Auszahlungen",null,{"$f":"L43","v":0},{"$f":"M44","v":0},{"$f":"N44","v":"Ganztäg. Zeitentnahmen Jahr"}]
[{"$f":"\"V \"&Version_Freigabe","v":"V 2026.1"},null,{"$f":"\"mobile Work / Telearbeit: \"&IF(H4=\"Ja\",'mW-HO'!C37&\"%\",\"n.a.\")","v":"mobile Work / Telearbeit: 0%"},null,null,null,"unter -20 Stunden",{"$f":"-H86*2","v":-0.83333333333333337},"Gesamtsaldo",{"$f":"J44","v":"Gesamtsaldo"},null,{"$f":"IF(H85>L44,\" \",L44)","v":" "}]
[null,null,null,null,null,null,null,null,null,null,null,{"$f":"IF(H87>L44,L44,\" \")","v":" "}]

{"sheet":"Februar","index":2,"n_rows":88,"n_cols":27,"rows_kept":88,"cut":false,"hidden":false,"merged":[[7,19,7,22],[7,15,7,18],[86,2,86,4],[6,11,6,13],[0,0,0,1],[1,0,1,1],[5,7,5,8],[50,3,50,4],[50,7,50,8],[5,3,5,4],[3,5,3,6]]}
[{"$f":"L44","v":-0.19097222222222227},null,"Gesamtsaldo",null,null,null,null,null,null,null,null,null,null,null,null,"Tages-","Mo",{"$f":"INDIRECT(\"'\"&$Y$2&\"'!\"&CELL(\"address\",R1))","v":0.25},null,null,null,null,null,null,"Hilfsspalte","Urlaubstage"]
[{"$f":"L41","v":0},null,"Dieser Monat",null,null,null,null,null,null,null,null,null,null,null,null,"arbeitszeit","Di",0.25,null,null,null,null,null,null,"Januar"]
[null,null,null,null,null,null,null,null,null,null,null,null,null,null,null,null,"Mi",0.25]
[null,null,"Anwesenheitsliste",null,{"$f":"Januar!E4","v":"2021-12-31"},"Report HO/mW Stat.:",null,"Ja","Monat:",{"$f":"VLOOKUP(MONTH(C10),Text_Monatsname,2,FALSE)","v":"Februar"},null,null,"Vertragliche regelmäßige Wochenarbeitszeit: ","\"hh:mm\"",{"$f":"IF(INDIRECT(\"'\"&$Y$2&\"'!\"&CELL(\"address\",O4))=\"\",\"\",INDIRECT(\"'\"&$Y$2&\"'!\"&CELL(\"address\",O4)))","v":1.25},null,"Do",0.25,null,null,null,null,null,null,{"$f":"Y5*Y6","v":1.25}]
[null,null,null,null,null,null,null,null,null,null,null,null,null,"oder: Industrieminuten \"hh,<1/10 h>\"",{"$f":"IF(INDIRECT(\"'\"&$Y$2&\"'!\"&CELL(\"address\",O5))=\"\",\"\",INDIRECT(\"'\"&$Y$2&\"'!\"&CELL(\"address\",O5)))","v":""},"Std/Woche","Fr",0.25,{"$f":"SUM(R1:R7)","v":1.25},null,null,null,null,null,{"$f":"IF(O4<>\"\",IF(O5=\"\",(DAY(O4)*24-24)+HOUR(O4)+MINUTE(O4)/60,IF(O5*Y6=O4,O5,\"Fehler\")),IF(O5<>\"\",O5,\"Fehler\"))","v":30}]
[null,null,"Name:",{"$f":"INDIRECT(\"'\"&$Y$2&\"'!\"&CELL(\"address\",D6))","v":0},null,null,"Vorname:",{"$f":"INDIRECT(\"'\"&$Y$2&\"'!\"&CELL(\"address\",H6))","v":0},null,"Pers.-Nr.:",{"$f":"INDIRECT(\"'\"&$Y$2&\"'!\"&CELL(\"address\",K6))","v":0},"Abteilung/Kostenstelle:",{"$f":"INDIRECT(\"'\"&$Y$2&\"'!\"&CELL(\"address\",M6))","v":0},null,{"$f":"IF(Y5=\"Fehler\",\"nur ein Wert!\",\"\")","v":""},"Mittagspause","Sa",0,{"$f":"IF(Y4=S5,\"Saldo O.K.\",\"Saldo falsch\")","v":"Saldo O.K."},null,null,null,null,null,"01:00:00"]
[null,null,null,null,null,null,null,null,null,null,null,"Mittagspause (Ja / Nein)  ",null,null,{"$f":"INDIRECT(\"'\"&$Y$2&\"'!\"&CELL(\"address\",O7))","v":"Ja"},{"$f":"INDIRECT(\"'\"&$Y$2&\"'!\"&CELL(\"address\",P7))","v":"00:35:00"},"So",0]
[null,"Soll","Datum","Kommen","Gehen","Anwesenh.","Gesamtzeit","Mittag","Arbeitszeit","Stunden","Bemerkungen",null,"Dienstl./Sonstige Abwesenheit",null,null,"Dokumentation sonstige Abwesenheit",null,null,null,"zusätzliche Reisezeit"]
[null,"Std","Tag","08:00:00",{"$f":"D9+I9+H9","v":"14:35:00"},"abs. u. TZ","10:00:00",{"$f":"IF(O7=\"NEIN\",0,P7)","v":"00:35:00"},{"$f":"Y4/5","v":"06:00:00"},"Saldo",null,"Hinweise","FT/U/GT/SD/K","SAR","Korrektur","von","bis","von","bis","von","bis","von","bis",null,null,{"$f":"VLOOKUP(J4,Werte_UrlaubstageProMonat,2,FALSE)","v":0}]
[{"$f":"VLOOKUP(WEEKDAY(C10,2),Text_Wochentag,2)","v":"So"},{"$f":"IF(OR(A10=\"Sa\",A10=\"So\"),\"0:00\",IF(Y10=\"FT\",\"0:00\",$I$9))","v":"0:00"},{"$f":"Januar!C40+1","v":"2022-01-31"},"00:00:00","00:00:00",null,{"$f":"IF(I10=\" \",0,I10 + IF(N10=\"Ja\", (U10-T10) + (W10-V10),0))","v":"00:00:00"},{"$f":"$H$9","v":"00:35:00"},{"$f":"IFERROR(IF(E10=0,IF(D10=0,\" \",E10-D10+F10-H10),TIME(HOUR(E10-D10+F10),MINUTE(E10-D10+F10),0)-H10) - IF(N10=\"Ja\",(Q10-P10) + (S10-R10),0),\" \")","v":" "},{"$f":"IF(Y10=\"GT\",-B10,IF(E10>0,G10-B10,IF(F10>0,G10-B10,\"     ---   \")))","v":"     ---   "},{"$f":"IF(G10<0,$I$9+D10+H10+O10, IFERROR(IF(OR(AND((I10*24)>9,((H10+IF(N10=\"Ja\",(Q10-P10)+(S10-R10),0))*24*60)<45),AND((I10*24)>6,((H10+IF(N10=\"Ja\",(Q10-P10)+(S10-R10),0))*24*60)<30)),\"->Pause<-\",\"\"),\"\"))","v":""},{"$f":"IF(ISERROR(VLOOKUP(C10,Feiertage,2,FALSE))=TRUE,IF(G10<0,\"Uhr  mind. Arbeitszeit\",IF(AND(I10<>\" \",I10>$G$9),\"Arbeitszeit >10 Std.\",\" \")),VLOOKUP(C10,Feiertage,2,FALSE))","v":" "},null,null,{"$f":"IF(N10=\"Ja\",((U10-T10)+(W10-V10))-((Q10-P10)+(S10-R10)),0)","v":0},null,null,null,null,null,null,null,null,null,{"$f":"UPPER(TRIM(M10))","v":""},{"$f":"IF(AA10=\"\",\"\",MAX(Z$9:Z9)+1)","v":""},{"$f":"IF(M10=\"U\",C10,\"\")","v":""}]
["Mo",{"$f":"IF(OR(A11=\"Sa\",A11=\"So\"),\"0:00\",IF(Y11=\"FT\",\"0:00\",$I$9))","v":"06:00:00"},{"$f":"C10+1","v":"2022-02-01"},"00:00:00","00:00:00",null,"00:00:00",{"$f":"$H$9","v":"00:35:00"}," ",{"$f":"IF(Y11=\"GT\",-B11,IF(E11>0,G11-B11,IF(F11>0,G11-B11,\"     ---   \")))","v":"     ---   "},{"$f":"IF(G11<0,$I$9+D11+H11+O11, IFERROR(IF(OR(AND((I11*24)>9,((H11+IF(N11=\"Ja\",(Q11-P11)+(S11-R11),0))*24*60)<45),AND((I11*24)>6,((H11+IF(N11=\"Ja\",(Q11-P11)+(S11-R11),0))*24*60)<30)),\"->Pause<-\",\"\"),\"\"))","v":""}," ",null,null,{"$f":"IF(N11=\"Ja\",((U11-T11)+(W11-V11))-((Q11-P11)+(S11-R11)),0)","v":0},null,null,null,null,null,null,null,null,null,"",{"$f":"IF(AA11=\"\",\"\",MAX(Z$9:Z10)+1)","v":""},{"$f":"IF(M11=\"U\",C11,\"\")","v":""}]
["Di","06:00:00",{"$f":"C11+1","v":"2022-02-02"},"00:00:00","00:00:00",null,"00:00:00","00:35:00"," ","     ---   ",""," ",{"$f":"IF(ISERROR(VLOOKUP(C12,Feiertage,2,FALSE))=TRUE,\"\",\"FT\")","v":""},null,{"$f":"IF(N12=\"Ja\",((U12-T12)+(W12-V12))-((Q12-P12)+(S12-R12)),0)","v":0},null,null,null,null,null,null,null,null,null,"",{"$f":"IF(AA12=\"\",\"\",MAX(Z$9:Z11)+1)","v":""},""]
["Mi","06:00:00","2022-02-03","00:00:00","00:00:00",null,{"$f":"IF(I13=\" \",0,I13 + IF(N13=\"Ja\", (U13-T13) + (W13-V13),0))","v":"00:00:00"},"00:35:00"," ","     ---   ",{"$f":"IF(G13<0,$I$9+D13+H13+O13, IFERROR(IF(OR(AND((I13*24)>9,((H13+IF(N13=\"Ja\",(Q13-P13)+(S13-R13),0))*24*60)<45),AND((I13*24)>6,((H13+IF(N13=\"Ja\",(Q13-P13)+(S13-R13),0))*24*60)<30)),\"->Pause<-\",\"\"),\"\"))","v":""}," ","",null,{"$f":"IF(N13=\"Ja\",((U13-T13)+(W13-V13))-((Q13-P13)+(S13-R13)),0)","v":0},null,null,null,null,null,null,null,null,null,"",{"$f":"IF(AA13=\"\",\"\",MAX(Z$9:Z12)+1)","v":""},""]
["Do","06:00:00","2022-02-04","00:00:00","00:00:00",null,{"$f":"IF(I14=\" \",0,I14 + IF(N14=\"Ja\", (U14-T14) + (W14-V14),0))","v":"00:00:00"},"00:35:00"," ","     ---   ",""," ","",null,{"$f":"IF(N14=\"Ja\",((U14-T14)+(W14-V14))-((Q14-P14)+(S14-R14)),0)","v":0},null,null,null,null,null,null,null,null,null,"",{"$f":"IF(AA14=\"\",\"\",MAX(Z$9:Z13)+1)","v":""},""]
["Fr","06:00:00","2022-02-05","00:00:00","00:00:00",null,{"$f":"IF(I15=\" \",0,I15 + IF(N15=\"Ja\", (U15-T15) + (W15-V15),0))","v":"00:00:00"},"00:35:00"," ","     ---   ",""," ","",null,{"$f":"IF(N15=\"Ja\",((U15-T15)+(W15-V15))-((Q15-P15)+(S15-R15)),0)","v":0},null,null,null,null,null,null,null,null,null,"",{"$f":"IF(AA15=\"\",\"\",MAX(Z$9:Z14)+1)","v":""},""]
["Sa","0:00","2022-02-06","00:00:00","00:00:00",null,"00:00:00","00:35:00",{"$f":"IFERROR(IF(E16=0,IF(D16=0,\" \",E16-D16+F16-H16),TIME(HOUR(E16-D16+F16),MINUTE(E16-D16+F16),0)-H16) - IF(N16=\"Ja\",(Q16-P16) + (S16-R16),0),\" \")","v":" "},"     ---   ",""," ",null,null,0,null,null,null,null,null,null,null,null,null,"",{"$f":"IF(AA16=\"\",\"\",MAX(Z$9:Z15)+1)","v":""},""]
["So","0:00","2022-02-07","00:00:00","00:00:00",null,"00:00:00","00:35:00"," ","     ---   ",""," ",null,null,0,null,null,null,null,null,null,null,null,null,"",{"$f":"IF(AA17=\"\",\"\",MAX(Z$9:Z16)+1)","v":""},""]
["Mo","06:00:00","2022-02-08","00:00:00","00:00:00",null,"00:00:00","00:35:00"," ","     ---   ",""," ",null,null,0,null,null,null,null,null,null,null,null,null,"",{"$f":"IF(AA18=\"\",\"\",MAX(Z$9:Z17)+1)","v":""},""]
["Di","06:00:00","2022-02-09","00:00:00","00:00:00",null,"00:00:00","00:35:00"," ","     ---   ",""," ",null,null,0,null,null,null,null,null,null,null,null,null,"",{"$f":"IF(AA19=\"\",\"\",MAX(Z$9:Z18)+1)","v":""},""]
["Mi","06:00:00","2022-02-10","00:00:00","00:00:00",null,"00:00:00","00:35:00"," ","     ---   ",""," ","",null,0,null,null,null,null,null,null,null,null,null,"",{"$f":"IF(AA20=\"\",\"\",MAX(Z$9:Z19)+1)","v":""},""]
["Do","06:00:00","2022-02-11","00:00:00","00:00:00",null,"00:00:00","00:35:00"," ","     ---   ",""," ","",null,0,null,null,null,null,null,null,null,null,null,"",{"$f":"IF(AA21=\"\",\"\",MAX(Z$9:Z20)+1)","v":""},""]
["Fr","06:00:00","2022-02-12","00:00:00","00:00:00",null,"00:00:00","00:35:00"," ","     ---   ",""," ","",null,0,null,null,null,null,null,null,null,null,null,"",{"$f":"IF(AA22=\"\",\"\",MAX(Z$9:Z21)+1)","v":""},""]
["Sa","0:00","2022-02-13","00:00:00","00:00:00",null,"00:00:00","00:35:00"," ","     ---   ",""," ","",null,0,null,null,null,null,null,null,null,null,null,"",{"$f":"IF(AA23=\"\",\"\",MAX(Z$9:Z22)+1)","v":""},""]
["So","0:00","2022-02-14","00:00:00","00:00:00",null,"00:00:00","00:35:00"," ","     ---   ",""," ","",null,0,null,null,null,null,null,null,null,null,null,"",{"$f":"IF(AA24=\"\",\"\",MAX(Z$9:Z23)+1)","v":""},""]
["Mo","06:00:00","2022-02-15","00:00:00","00:00:00",null,"00:00:00","00:35:00"," ","     ---   ",""," ","",null,0,null,null,null,null,null,null,null,null,null,"",{"$f":"IF(AA25=\"\",\"\",MAX(Z$9:Z24)+1)","v":""},""]
["Di","06:00:00","2022-02-16","00:00:00","00:00:00",null,"00:00:00","00:35:00"," ","     ---   ",""," ","",null,0,null,null,null,null,null,null,null,null,null,"",{"$f":"IF(AA26=\"\",\"\",MAX(Z$9:Z25)+1)","v":""},""]
["Mi","06:00:00","2022-02-17","00:00:00","00:00:00",null,"00:00:00","00:35:00"," ","     ---   ",""," ","",null,0,null,null,null,null,null,null,null,null,null,"",{"$f":"IF(AA27=\"\",\"\",MAX(Z$9:Z26)+1)","v":""},""]
["Do","06:00:00","2022-02-18","00:00:00","00:00:00",null,"00:00:00","00:35:00"," ","     ---   ",""," ","",null,0,null,null,null,null,null,null,null,null,null,"",{"$f":"IF(AA28=\"\",\"\",MAX(Z$9:Z27)+1)","v":""},""]
["Fr","06:00:00","2022-02-19","00:00:00","00:00:00",null,"00:00:00","00:35:00"," ","     ---   ",""," ","",null,0,null,null,null,null,null,null,null,null,null,"",{"$f":"IF(AA29=\"\",\"\",MAX(Z$9:Z28)+1)","v":""},""]
["Sa","0:00","2022-02-20","00:00:00","00:00:00",null,"00:00:00","00:35:00"," ","     ---   ",""," ",null,null,0,null,null,null,null,null,null,null,null,null,"",{"$f":"IF(AA30=\"\",\"\",MAX(Z$9:Z29)+1)","v":""},""]
["So","0:00","2022-02-21","00:00:00","00:00:00",null,"00:00:00","00:35:00"," ","     ---   ",""," ","",null,0,null,null,null,null,null,null,null,null,null,"",{"$f":"IF(AA31=\"\",\"\",MAX(Z$9:Z30)+1)","v":""},""]
["Mo","06:00:00","2022-02-22","00:00:00","00:00:00",null,"00:00:00","00:35:00"," ","     ---   ",""," ","",null,0,null,null,null,null,null,null,null,null,null,"",{"$f":"IF(AA32=\"\",\"\",MAX(Z$9:Z31)+1)","v":""},""]
["Di","06:00:00","2022-02-23","00:00:00","00:00:00",null,"00:00:00","00:35:00"," ","     ---   ",""," ","",null,0,null,null,null,null,null,null,null,null,null,"",{"$f":"IF(AA33=\"\",\"\",MAX(Z$9:Z32)+1)","v":""},""]
["Mi","06:00:00","2022-02-24","00:00:00","00:00:00",null,"00:00:00","00:35:00"," ","     ---   ",""," ","",null,0,null,null,null,null,null,null,null,null,null,"",{"$f":"IF(AA34=\"\",\"\",MAX(Z$9:Z33)+1)","v":""},""]
["Do","06:00:00","2022-02-25","00:00:00","00:00:00",null,"00:00:00","00:35:00"," ","     ---   ",""," ","",null,0,null,null,null,null,null,null,null,null,null,"",{"$f":"IF(AA35=\"\",\"\",MAX(Z$9:Z34)+1)","v":""},""]
["Fr","06:00:00","2022-02-26","00:00:00","00:00:00",null,"00:00:00","00:35:00"," ","     ---   ",""," ","",null,0,null,null,null,null,null,null,null,null,null,"",{"$f":"IF(AA36=\"\",\"\",MAX(Z$9:Z35)+1)","v":""},""]
["Sa","0:00","2022-02-27","00:00:00","00:00:00",null,"00:00:00","00:35:00"," ","     ---   ",""," ","",null,0,null,null,null,null,null,null,null,null,null,"",{"$f":"IF(AA37=\"\",\"\",MAX(Z$9:Z36)+1)","v":""},""]
["Sa","0:00",{"$f":"IF(MONTH(C37+1)=2,C37+1,C37)","v":"2022-02-27"},"00:00:00","00:00:00",null,"00:00:00","00:35:00"," ","     ---   ","",{"$f":"IF(ISERROR(VLOOKUP(C38,Feiertage,2,FALSE))=TRUE,IF(G38<0,\"Uhr  mind. Arbeitszeit\",IF((G38-H38-((Q38-P38)+(S38-R38)))>$G$9,\"Arbeitszeit >10 Std.\",\" \")),VLOOKUP(C38,Feiertage,2,FALSE))","v":" "},"",null,0,null,null,null,null,null,null,null,null,null,"",{"$f":"IF(AA38=\"\",\"\",MAX(Z$9:Z37)+1)","v":""},""]
[null,null,null,null,null,null,null,null,null,null,{"$f":"IF(OR(AND((G39*24)>9,(H39*24*60)<45),AND((G39*24)>6,(H39*24*60)<30)),\"Pause!\",\" \")","v":" "}]
[null,null,null,null,null,null,null,null,null,null," "]
[null,null,null,null,null,null,null,null,null,{"$f":"SUM(J10:J38)","v":0},"Mon.saldo",{"$f":"J41","v":0},null,null,null,null,null,null,null,null,null,null,null,null,null,{"$f":"IF(AA41=\"\",\"\",MAX(Z$9:Z38)+1)","v":""},""]
[null,null,null,null,null,null,null,null,null,"+ Saldo / Vormonate",null,{"$f":"Januar!L44","v":-0.19097222222222227},{"$f":"VLOOKUP($J$4,Tabelle_Kürzel_Abwesenheit,Spalte_GT_Monat,FALSE)","v":0},"Ganztäg. Zeitentnahmen lfd. Monat",null,{"$f":"VLOOKUP($J$4,Tabelle_Kürzel_Abwesenheit,Spalte_U_Monat,FALSE)","v":0},"Urlaub lfd. Monat",{"$f":"VLOOKUP($J$4,Tabelle_Kürzel_Abwesenheit,Spalte_K_Monat,FALSE)","v":0},"krank lfd. Monat",null,null,null,null,null,null,{"$f":"IF(AA42=\"\",\"\",MAX(Z$9:Z41)+1)","v":""},""]
[null,null,null,null,null,null,null,null,null,"- Auszahlungen",null,0,{"$f":"VLOOKUP($J$4,Tabelle_Kürzel_Abwesenheit,Spalte_GT_Summe,FALSE)","v":0},"Ganztäg. Zeitentnahmen Jahr",null,{"$f":"VLOOKUP($J$4,Tabelle_Kürzel_Abwesenheit,Spalte_U_Summe,FALSE)","v":0},"Urlaub Jahr",{"$f":"VLOOKUP($J$4,Tabelle_Kürzel_Abwesenheit,Spalte_K_Summe,FALSE)","v":0},"krank Jahr"]
[null,null,null,null,null,null,null,null,null,"Gesamtsaldo",null,{"$f":"SUM(L41:L42)-L43","v":-0.19097222222222227},null,null,null,null,null,null,null,null,null,null,null,null,null,{"$f":"MAX(Z9:Z42)","v":0},{"$f":"COUNT(AA10:AA42)","v":0}]
[]
[]
[]
[]
[null,null,"Vorgesetzten-",null,{"$f":"E4","v":"2021-12-31"},null,null,null,{"$f":"I4","v":"Monat:"},{"$f":"J4","v":"Februar"},null,null,null,{"$f":"M4","v":"Vertragliche regelmäßige Wochenarbeitszeit: "},{"$f":"Y5","v":30},{"$f":"P5","v":"Std/Woche"}]
[null,null,"Meldung"]
[null,null,{"$f":"C6","v":"Name:"},{"$f":"D6","v":0},null,null,{"$f":"G6","v":"Vorname:"},{"$f":"H6","v":0},null,{"$f":"J6","v":"Pers.-Nr.:"},{"$f":"K6","v":0},"Abteilung/Kostenstelle:",{"$f":"M6","v":0}]
[null,null,null,null,null,null,null,null,null,null,null,null,null,"Bemerkungen"]
[null,null,{"$f":"C8","v":"Datum"},"Kommen","Gehen","Anwesenh.",{"$f":"G8","v":"Gesamtzeit"},"Mittag","Arbeitszeit","Stunden","Bemerkungen"]
[null,null,"Tag","08:00:00","14:35:00","abs. u. TZ","10:00:00","00:35:00","06:00:00","Saldo",null,"Hinweise",{"$f":"M9","v":"FT/U/GT/SD/K"}]
[{"$f":"A10","v":"So"},"0:00","2022-01-31",{"$f":"IF(D10=0,\" \",IF(OR($A55=\"Sa\",$A55=\"So\",$M55=\"FT\"),D10,IF(D10<$D$85,D10,\" \")))","v":" "},{"$f":"IF(E10=0,\" \",IF(OR($A55=\"Sa\",$A55=\"So\",$M55=\"FT\"),E10,IF(E10>$D$86,E10,\" \")))","v":" "},null,{"$f":"IF(G10=0,\" \",IF(G10-H10-O10>$H$87,G10,\" \"))","v":" "},{"$f":"IF(K10=\"->Pause<-\",\"Pause!\",\"\")","v":""},null,null,{"$f":"IF(G55<>\" \",\"AZ > 10 h\",\" \")","v":" "},{"$f":"IF(ISERROR(VLOOKUP(C55,Feiertage,2,FALSE))=TRUE,IF(E55<>\" \",\"Kommen/Gehen vor/nach 06:30/20:00\",IF(D55<>\" \",\"Kommen/Gehen vor/nach 06:30/20:00\",\" \")),VLOOKUP(C55,Feiertage,2,FALSE))","v":" "},{"$f":"IF(Y10>0,Y10,\" \")","v":""},null,null,null,null,null,null,null,null,null,null,null,{"$f":"Y10","v":""}]
["Mo","06:00:00","2022-02-01"," "," ",null," ","",null,null,{"$f":"IF(G56<>\" \",\"AZ > 10 h\",\" \")","v":" "}," ",{"$f":"IF(Y11>0,Y11,\" \")","v":""},null,null,null,null,null,null,null,null,null,null,null,""]
["Di","06:00:00","2022-02-02"," "," ",null," ","",null,null," "," ","",null,null,null,null,null,null,null,null,null,null,null,""]
["Mi","06:00:00","2022-02-03"," "," ",null," ","",null,null," "," ","",null,null,null,null,null,null,null,null,null,null,null,""]
["Do","06:00:00","2022-02-04"," "," ",null," ","",null,null," "," ","",null,null,null,null,null,null,null,null,null,null,null,""]
["Fr","06:00:00","2022-02-05"," "," ",null," ","",null,null," "," ","",null,null,null,null,null,null,null,null,null,null,null,""]
["Sa","0:00","2022-02-06"," "," ",null," ","",null,null," "," ","",null,null,null,null,null,null,null,null,null,null,null,""]
["So","0:00","2022-02-07"," "," ",null," ","",null,null," "," ","",null,null,null,null,null,null,null,null,null,null,null,""]
["Mo","06:00:00","2022-02-08"," "," ",null," ","",null,null," "," ","",null,null,null,null,null,null,null,null,null,null,null,""]
["Di","06:00:00","2022-02-09"," "," ",null," ","",null,null," "," ","",null,null,null,null,null,null,null,null,null,null,null,""]
["Mi","06:00:00","2022-02-10"," "," ",null," ","",null,null," "," ","",null,null,null,null,null,null,null,null,null,null,null,""]
["Do","06:00:00","2022-02-11"," "," ",null," ","",null,null," "," ","",null,null,null,null,null,null,null,null,null,null,null,""]
["Fr","06:00:00","2022-02-12"," "," ",null," ","",null,null," "," ","",null,null,null,null,null,null,null,null,null,null,null,""]
["Sa","0:00","2022-02-13"," "," ",null," ","",null,null," "," ","",null,null,null,null,null,null,null,null,null,null,null,""]
["So","0:00","2022-02-14"," "," ",null," ","",null,null," "," ","",null,null,null,null,null,null,null,null,null,null,null,""]
["Mo","06:00:00","2022-02-15"," "," ",null," ","",null,null," "," ","",null,null,null,null,null,null,null,null,null,null,null,""]
[{"$f":"A26","v":"Di"},"06:00:00","2022-02-16"," "," ",null," ","",null,null," "," ","",null,null,null,null,null,null,null,null,null,null,null,""]
["Mi","06:00:00","2022-02-17"," "," ",null," ","",null,null," "," ","",null,null,null,null,null,null,null,null,null,null,null,""]
["Do","06:00:00","2022-02-18"," "," ",null," ","",null,null," "," ","",null,null,null,null,null,null,null,null,null,null,null,""]
["Fr","06:00:00","2022-02-19"," "," ",null," ","",null,null," "," ","",null,null,null,null,null,null,null,null,null,null,null,""]
["Sa","0:00","2022-02-20"," "," ",null," ","",null,null," "," ","",null,null,null,null,null,null,null,null,null,null,null,""]
[{"$f":"A31","v":"So"},"0:00","2022-02-21"," "," ",null," ","",null,null," "," ","",null,null,null,null,null,null,null,null,null,null,null,""]
[{"$f":"A32","v":"Mo"},"06:00:00","2022-02-22"," "," ",null," ","",null,null," "," ","",null,null,null,null,null,null,null,null,null,null,null,""]
["Di","06:00:00","2022-02-23"," "," ",null," ","",null,null," "," ","",null,null,null,null,null,null,null,null,null,null,null,""]
["Mi","06:00:00","2022-02-24"," "," ",null," ","",null,null," "," ","",null,null,null,null,null,null,null,null,null,null,null,""]
["Do","06:00:00","2022-02-25"," "," ",null," ","",null,null," "," ","",null,null,null,null,null,null,null,null,null,null,null,""]
["Fr","06:00:00","2022-02-26"," "," ",null," ","",null,null," "," ","",null,null,null,null,null,null,null,null,null,null,null,""]
["Sa","0:00","2022-02-27"," "," ",null," ","",null,null," "," ","",null,null,null,null,null,null,null,null,null,null,null,""]
["Sa","0:00","2022-02-27"," "," ",null," ","",null,null,{"$f":"IF(G83<>\" \",\"AZ > 10 h\",\" \")","v":" "}," ","",null,null,null,null,null,null,null,null,null,null,null,""]
[null,null,"Meldegründe:",null,null,null,null,null,null,null,{"$f":"K41","v":"Mon.saldo"}]
[null,null,"vor","06:30:00",null,null,null,null,null,{"$f":"J42","v":"+ Saldo / Vormonate"},null,null,{"$f":"M42","v":0},{"$f":"N42","v":"Ganztäg. Zeitentnahmen lfd. Monat"}]
[null,null,"nach ","20:00:00",null,null,"Über 60 Stunden",{"$f":"H87*6","v":2.5},"Gesamtsaldo","- Auszahlungen",null,{"$f":"L43","v":0}]
[{"$f":"Januar!A87","v":"V 2026.1"},null,{"$f":"\"mobile Work / Telearbeit: \"&IF(H4=\"Ja\",'mW-HO'!F37&\"%\",\"n.a.\")","v":"mobile Work / Telearbeit: 0%"},null,null,null,"Über",{"$f":"G9","v":"10:00:00"},"Std. tägl.",{"$f":"J44","v":"Gesamtsaldo"},null,{"$f":"IF(H86>L44,\" \",L44)","v":" "},{"$f":"M43","v":0},{"$f":"N43","v":"Ganztäg. Zeitentnahmen Jahr"}]
[null,null,null,null,null,null,"unter -20 Stunden",{"$f":"-H87*2","v":-0.83333333333333337},"Gesamtsaldo",null,null,{"$f":"IF(H88>L44,L44,\" \")","v":" "}]

{"sheet":"März","index":3,"n_rows":87,"n_cols":27,"rows_kept":87,"cut":false,"hidden":false,"merged":[[7,19,7,22],[42,9,42,10],[7,15,7,18],[85,2,85,4],[6,11,6,13],[0,0,0,1],[1,0,1,1],[47,3,47,4],[47,7,47,8],[5,7,5,8],[5,3,5,4],[3,5,3,6]]}
[{"$f":"L44","v":-0.19097222222222227},null,"Gesamtsaldo",null,null,null,null,null,null,null,null,null,null,null,null,"Tages-","Mo",{"$f":"INDIRECT(\"'\"&$Y$2&\"'!\"&CELL(\"address\",R1))","v":0.25},null,null,null,null,null,null,"Hilfsspalte","Urlaubstage"]
[{"$f":"L41","v":0},null,"Dieser Monat",null,null,null,null,null,null,null,null,null,null,null,null,"arbeitszeit","Di",0.25,null,null,null,null,null,null,"Februar"]
[null,null,null,null,null,null,null,null,null,null,null,null,null,null,null,null,"Mi",0.25]
[null,null,"Anwesenheitsliste",null,{"$f":"Januar!E4","v":"2021-12-31"},"Report HO/mW Stat.:",null,"Ja","Monat:",{"$f":"VLOOKUP(MONTH(C10),Text_Monatsname,2,FALSE)","v":"März"},null,null,"Vertragliche regelmäßige Wochenarbeitszeit: ","\"hh:mm\"",{"$f":"IF(INDIRECT(\"'\"&$Y$2&\"'!\"&CELL(\"address\",O4))=\"\",\"\",INDIRECT(\"'\"&$Y$2&\"'!\"&CELL(\"address\",O4)))","v":1.25},null,"Do",0.25,null,null,null,null,null,null,{"$f":"Y5*Y6","v":1.25}]
[null,null,null,null,null,null,null,null,null,null,null,null,null,"oder: Industrieminuten \"hh,<1/10 h>\"",{"$f":"IF(INDIRECT(\"'\"&$Y$2&\"'!\"&CELL(\"address\",O5))=\"\",\"\",INDIRECT(\"'\"&$Y$2&\"'!\"&CELL(\"address\",O5)))","v":""},"Std/Woche","Fr",0.25,{"$f":"SUM(R1:R7)","v":1.25},null,null,null,null,null,{"$f":"IF(O4<>\"\",IF(O5=\"\",(DAY(O4)*24-24)+HOUR(O4)+MINUTE(O4)/60,IF(O5*Y6=O4,O5,\"Fehler\")),IF(O5<>\"\",O5,\"Fehler\"))","v":30}]
[null,null,"Name:",{"$f":"INDIRECT(\"'\"&$Y$2&\"'!\"&CELL(\"address\",D6))","v":0},null,null,"Vorname:",{"$f":"INDIRECT(\"'\"&$Y$2&\"'!\"&CELL(\"address\",H6))","v":0},null,"Pers.-Nr.:",{"$f":"INDIRECT(\"'\"&$Y$2&\"'!\"&CELL(\"address\",K6))","v":0},"Abteilung/Kostenstelle:",{"$f":"INDIRECT(\"'\"&$Y$2&\"'!\"&CELL(\"address\",M6))","v":0},null,{"$f":"IF(Y5=\"Fehler\",\"nur ein Wert!\",\"\")","v":""},"Mittagspause","Sa",0,{"$f":"IF(Y4=S5,\"Saldo O.K.\",\"Saldo falsch\")","v":"Saldo O.K."},null,null,null,null,null,"01:00:00"]
[null,null,null,null,null,null,null,null,null,null,null,"Mittagspause (Ja / Nein)  ",null,null,{"$f":"INDIRECT(\"'\"&$Y$2&\"'!\"&CELL(\"address\",O7))","v":"Ja"},{"$f":"INDIRECT(\"'\"&$Y$2&\"'!\"&CELL(\"address\",P7))","v":"00:35:00"},"So",0]
[null,"Soll","Datum","Kommen","Gehen","Anwesenh.","Gesamtzeit","Mittag","Arbeitszeit","Stunden","Bemerkungen",null,"Dienstl./Sonstige Abwesenheit",null,null,"Dokumentation sonstige Abwesenheit",null,null,null,"zusätzliche Reisezeit"]
[null,"Std","Tag","08:00:00",{"$f":"D9+I9+H9","v":"14:35:00"},"abs. u. TZ","10:00:00",{"$f":"IF(O7=\"NEIN\",0,P7)","v":"00:35:00"},{"$f":"Y4/5","v":"06:00:00"},"Saldo",null,"Hinweise","FT/U/GT/SD/K","SAR","Korrektur","von","bis","von","bis","von","bis","von","bis",null,null,{"$f":"VLOOKUP(J4,Werte_UrlaubstageProMonat,2,FALSE)","v":0}]
[{"$f":"VLOOKUP(WEEKDAY(C10,2),Text_Wochentag,2)","v":"So"},{"$f":"IF(OR(A10=\"Sa\",A10=\"So\"),\"0:00\",IF(Y10=\"FT\",\"0:00\",$I$9))","v":"0:00"},{"$f":"Februar!C38+1","v":"2022-02-28"},"00:00:00","00:00:00",null,{"$f":"IF(E10=0,IF(D10=\"\",0,E10-D10+F10),TIME(HOUR(E10-D10+F10),MINUTE(E10-D10+F10),0))","v":"00:00:00"},{"$f":"$H$9","v":"00:35:00"},{"$f":"IFERROR(IF(E10=0,IF(D10=0,\" \",E10-D10+F10-H10),TIME(HOUR(E10-D10+F10),MINUTE(E10-D10+F10),0)-H10) - IF(N10=\"Ja\",(Q10-P10) + (S10-R10),0),\" \")","v":" "},{"$f":"IF(Y10=\"GT\",-B10,IF(E10>0,G10-B10,IF(F10>0,G10-B10,\"     ---   \")))","v":"     ---   "},{"$f":"IF(G10<0,$I$9+D10+H10+O10, IFERROR(IF(OR(AND((I10*24)>9,((H10+O10)*24*60)<45),AND((I10*24)>6,((H10+O10)*24*60)<30)),\"->Pause<-\",\"\"),\"\"))","v":""},{"$f":"IF(ISERROR(VLOOKUP(C10,Feiertage,2,FALSE))=TRUE,IF(G10<0,\"Uhr  mind. Arbeitszeit\",IF(AND(I10<>\" \",I10>$G$9),\"Arbeitszeit >10 Std.\",\" \")),VLOOKUP(C10,Feiertage,2,FALSE))","v":" "},{"$f":"IF(ISERROR(VLOOKUP(C10,Feiertage,2,FALSE))=TRUE,\"\",\"FT\")","v":""},null,{"$f":"IF(N10=\"Ja\",((U10-T10)+(W10-V10))-((Q10-P10)+(S10-R10)),0)","v":0},null,null,null,null,null,null,null,null,null,{"$f":"UPPER(TRIM(M10))","v":""},{"$f":"IF(AA10=\"\",\"\",MAX(Z$9:Z9)+1)","v":""},{"$f":"IF(M10=\"U\",C10,\"\")","v":""}]
["Mo",{"$f":"IF(OR(A11=\"Sa\",A11=\"So\"),\"0:00\",IF(Y11=\"FT\",\"0:00\",$I$9))","v":"06:00:00"},{"$f":"C10+1","v":"2022-03-01"},"00:00:00","00:00:00",null,{"$f":"IF(I11=\" \",0,I11 + IF(N11=\"Ja\", (U11-T11) + (W11-V11),0))","v":"00:00:00"},{"$f":"$H$9","v":"00:35:00"},{"$f":"IFERROR(IF(E11=0,IF(D11=0,\" \",E11-D11+F11-H11),TIME(HOUR(E11-D11+F11),MINUTE(E11-D11+F11),0)-H11) - IF(N11=\"Ja\",(Q11-P11) + (S11-R11),0),\" \")","v":" "},{"$f":"IF(Y11=\"GT\",-B11,IF(E11>0,G11-B11,IF(F11>0,G11-B11,\"     ---   \")))","v":"     ---   "},{"$f":"IF(G11<0,$I$9+D11+H11+O11, IFERROR(IF(OR(AND((I11*24)>9,((H11+IF(N11=\"Ja\",(Q11-P11)+(S11-R11),0))*24*60)<45),AND((I11*24)>6,((H11+IF(N11=\"Ja\",(Q11-P11)+(S11-R11),0))*24*60)<30)),\"->Pause<-\",\"\"),\"\"))","v":""}," ",null,null,{"$f":"IF(N11=\"Ja\",((U11-T11)+(W11-V11))-((Q11-P11)+(S11-R11)),0)","v":0},null,null,null,null,null,null,null,null,null,"",{"$f":"IF(AA11=\"\",\"\",MAX(Z$9:Z10)+1)","v":""},{"$f":"IF(M11=\"U\",C11,\"\")","v":""}]
["Di","06:00:00",{"$f":"C11+1","v":"2022-03-02"},"00:00:00","00:00:00",null,{"$f":"IF(I12=\" \",0,I12 + IF(N12=\"Ja\", (U12-T12) + (W12-V12),0))","v":"00:00:00"},"00:35:00",{"$f":"IFERROR(IF(E12=0,IF(D12=0,\" \",E12-D12+F12-H12),TIME(HOUR(E12-D12+F12),MINUTE(E12-D12+F12),0)-H12) - IF(N12=\"Ja\",(Q12-P12) + (S12-R12),0),\" \")","v":" "},"     ---   ",{"$f":"IF(G12<0,$I$9+D12+H12+O12, IFERROR(IF(OR(AND((I12*24)>9,((H12+O12)*24*60)<45),AND((I12*24)>6,((H12+O12)*24*60)<30)),\"->Pause<-\",\"\"),\"\"))","v":""}," ","",null,{"$f":"IF(N12=\"Ja\",((U12-T12)+(W12-V12))-((Q12-P12)+(S12-R12)),0)","v":0},null,null,null,null,null,null,null,null,null,"",{"$f":"IF(AA12=\"\",\"\",MAX(Z$9:Z11)+1)","v":""},""]
["Mi","06:00:00","2022-03-03","00:00:00","00:00:00",null,"00:00:00","00:35:00"," ","     ---   ",{"$f":"IF(G13<0,$I$9+D13+H13+O13, IFERROR(IF(OR(AND((I13*24)>9,((H13+O13)*24*60)<45),AND((I13*24)>6,((H13+O13)*24*60)<30)),\"->Pause<-\",\"\"),\"\"))","v":""}," ","",null,0,null,null,null,null,null,null,null,null,null,"",{"$f":"IF(AA13=\"\",\"\",MAX(Z$9:Z12)+1)","v":""},""]
["Do","06:00:00","2022-03-04","00:00:00","00:00:00",null,"00:00:00","00:35:00"," ","     ---   ",""," ","",null,0,null,null,null,null,null,null,null,null,null,"",{"$f":"IF(AA14=\"\",\"\",MAX(Z$9:Z13)+1)","v":""},""]
["Fr","06:00:00","2022-03-05","00:00:00","00:00:00",null,"00:00:00","00:35:00"," ","     ---   ",""," ","",null,0,null,null,null,null,null,null,null,null,null,"",{"$f":"IF(AA15=\"\",\"\",MAX(Z$9:Z14)+1)","v":""},""]
["Sa","0:00","2022-03-06","00:00:00","00:00:00",null,"00:00:00","00:35:00"," ","     ---   ",""," ","",null,0,null,null,null,null,null,null,null,null,null,"",{"$f":"IF(AA16=\"\",\"\",MAX(Z$9:Z15)+1)","v":""},""]
["So","0:00","2022-03-07","00:00:00","00:00:00",null,"00:00:00","00:35:00"," ","     ---   ",""," ","",null,0,null,null,null,null,null,null,null,null,null,"",{"$f":"IF(AA17=\"\",\"\",MAX(Z$9:Z16)+1)","v":""},""]
["Mo","06:00:00","2022-03-08","00:00:00","00:00:00",null,"00:00:00","00:35:00"," ","     ---   ",""," ","",null,0,null,null,null,null,null,null,null,null,null,"",{"$f":"IF(AA18=\"\",\"\",MAX(Z$9:Z17)+1)","v":""},""]
["Di","06:00:00","2022-03-09","00:00:00","00:00:00",null,"00:00:00","00:35:00",{"$f":"IFERROR(IF(E19=0,IF(D19=0,\" \",E19-D19+F19-H19),TIME(HOUR(E19-D19+F19),MINUTE(E19-D19+F19),0)-H19) - IF(N19=\"Ja\",(Q19-P19) + (S19-R19),0),\" \")","v":" "},"     ---   ",""," ","",null,0,null,null,null,null,null,null,null,null,null,"",{"$f":"IF(AA19=\"\",\"\",MAX(Z$9:Z18)+1)","v":""},""]
["Mi","06:00:00","2022-03-10","00:00:00","00:00:00",null,"00:00:00","00:35:00"," ","     ---   ",""," ","",null,0,null,null,null,null,null,null,null,null,null,"",{"$f":"IF(AA20=\"\",\"\",MAX(Z$9:Z19)+1)","v":""},""]
["Do","06:00:00","2022-03-11","00:00:00","00:00:00",null,"00:00:00","00:35:00"," ","     ---   ",""," ","",null,0,null,null,null,null,null,null,null,null,null,"",{"$f":"IF(AA21=\"\",\"\",MAX(Z$9:Z20)+1)","v":""},""]
["Fr","06:00:00","2022-03-12","00:00:00","00:00:00",null,"00:00:00","00:35:00"," ","     ---   ",""," ","",null,0,null,null,null,null,null,null,null,null,null,"",{"$f":"IF(AA22=\"\",\"\",MAX(Z$9:Z21)+1)","v":""},""]
["Sa","0:00","2022-03-13","00:00:00","00:00:00",null,"00:00:00","00:35:00"," ","     ---   ",""," ","",null,0,null,null,null,null,null,null,null,null,null,"",{"$f":"IF(AA23=\"\",\"\",MAX(Z$9:Z22)+1)","v":""},""]
["So","0:00","2022-03-14","00:00:00","00:00:00",null,"00:00:00","00:35:00"," ","     ---   ",""," ","",null,0,null,null,null,null,null,null,null,null,null,"",{"$f":"IF(AA24=\"\",\"\",MAX(Z$9:Z23)+1)","v":""},""]
["Mo","06:00:00","2022-03-15","00:00:00","00:00:00",null,"00:00:00","00:35:00"," ","     ---   ",""," ","",null,0,null,null,null,null,null,null,null,null,null,"",{"$f":"IF(AA25=\"\",\"\",MAX(Z$9:Z24)+1)","v":""},""]
["Di","06:00:00","2022-03-16","00:00:00","00:00:00",null,"00:00:00","00:35:00"," ","     ---   ",""," ","",null,0,null,null,null,null,null,null,null,null,null,"",{"$f":"IF(AA26=\"\",\"\",MAX(Z$9:Z25)+1)","v":""},""]
["Mi","06:00:00","2022-03-17","00:00:00","00:00:00",null,"00:00:00","00:35:00"," ","     ---   ",""," ","",null,0,null,null,null,null,null,null,null,null,null,"",{"$f":"IF(AA27=\"\",\"\",MAX(Z$9:Z26)+1)","v":""},""]
["Do","06:00:00","2022-03-18","00:00:00","00:00:00",null,"00:00:00","00:35:00",{"$f":"IFERROR(IF(E28=0,IF(D28=0,\" \",E28-D28+F28-H28),TIME(HOUR(E28-D28+F28),MINUTE(E28-D28+F28),0)-H28) - IF(N28=\"Ja\",(Q28-P28) + (S28-R28),0),\" \")","v":" "},"     ---   ",""," ",null,null,0,null,null,null,null,null,null,null,null,null,"",{"$f":"IF(AA28=\"\",\"\",MAX(Z$9:Z27)+1)","v":""},""]
["Fr","06:00:00","2022-03-19","00:00:00","00:00:00",null,"00:00:00","00:35:00"," ","     ---   ",""," ","",null,0,null,null,null,null,null,null,null,null,null,"",{"$f":"IF(AA29=\"\",\"\",MAX(Z$9:Z28)+1)","v":""},""]
["Sa","0:00","2022-03-20","00:00:00","00:00:00",null,"00:00:00","00:35:00"," ","     ---   ",""," ","",null,0,null,null,null,null,null,null,null,null,null,"",{"$f":"IF(AA30=\"\",\"\",MAX(Z$9:Z29)+1)","v":""},""]
["So","0:00","2022-03-21","00:00:00","00:00:00",null,"00:00:00","00:35:00"," ","     ---   ",""," ","",null,0,null,null,null,null,null,null,null,null,null,"",{"$f":"IF(AA31=\"\",\"\",MAX(Z$9:Z30)+1)","v":""},""]
["Mo","06:00:00","2022-03-22","00:00:00","00:00:00",null,"00:00:00","00:35:00"," ","     ---   ",""," ","",null,0,null,null,null,null,null,null,null,null,null,"",{"$f":"IF(AA32=\"\",\"\",MAX(Z$9:Z31)+1)","v":""},""]
["Di","06:00:00","2022-03-23","00:00:00","00:00:00",null,"00:00:00","00:35:00"," ","     ---   ",""," ","",null,0,null,null,null,null,null,null,null,null,null,"",{"$f":"IF(AA33=\"\",\"\",MAX(Z$9:Z32)+1)","v":""},""]
["Mi","06:00:00","2022-03-24","00:00:00","00:00:00",null,"00:00:00","00:35:00"," ","     ---   ",""," ","",null,0,null,null,null,null,null,null,null,null,null,"",{"$f":"IF(AA34=\"\",\"\",MAX(Z$9:Z33)+1)","v":""},""]
["Do","06:00:00","2022-03-25","00:00:00","00:00:00",null,"00:00:00","00:35:00"," ","     ---   ",""," ","",null,0,null,null,null,null,null,null,null,null,null,"",{"$f":"IF(AA35=\"\",\"\",MAX(Z$9:Z34)+1)","v":""},""]
["Fr","06:00:00","2022-03-26","00:00:00","00:00:00",null,"00:00:00","00:35:00"," ","     ---   ",""," ",null,null,0,null,null,null,null,null,null,null,null,null,"",{"$f":"IF(AA36=\"\",\"\",MAX(Z$9:Z35)+1)","v":""},""]
["Sa","0:00","2022-03-27","00:00:00","00:00:00",null,"00:00:00","00:35:00"," ","     ---   ",""," ","",null,0,null,null,null,null,null,null,null,null,null,"",{"$f":"IF(AA37=\"\",\"\",MAX(Z$9:Z36)+1)","v":""},""]
["So","0:00","2022-03-28","00:00:00","00:00:00",null,"00:00:00","00:35:00"," ","     ---   ",""," ","",null,0,null,null,null,null,null,null,null,null,null,"",{"$f":"IF(AA38=\"\",\"\",MAX(Z$9:Z37)+1)","v":""},""]
["Mo","06:00:00",{"$f":"C38+1","v":"2022-03-29"},"00:00:00","00:00:00",null,"00:00:00","00:35:00"," ","     ---   ",""," ","",null,0,null,null,null,null,null,null,null,null,null,"",{"$f":"IF(AA39=\"\",\"\",MAX(Z$9:Z38)+1)","v":""},""]
["Di","06:00:00",{"$f":"C39+1","v":"2022-03-30"},"00:00:00","00:00:00",null,"00:00:00","00:35:00"," ","     ---   ",""," ","",null,0,null,null,null,null,null,null,null,null,null,"",{"$f":"IF(AA40=\"\",\"\",MAX(Z$9:Z39)+1)","v":""},""]
[null,null,null,null,null,null,null,null,null,{"$f":"SUM(J10:J40)","v":0},"Mon.saldo",{"$f":"J41","v":0},null,null,null,null,null,null,null,null,null,null,null,null,null,{"$f":"MAX(Z9:Z40)","v":0},{"$f":"COUNT(AA10:AA40)","v":0}]
[null,null,null,null,null,null,null,null,null,"+ Saldo / Vormonate",null,{"$f":"Februar!L44","v":-0.19097222222222227},{"$f":"VLOOKUP($J$4,Tabelle_Kürzel_Abwesenheit,Spalte_GT_Monat,FALSE)","v":0},"Ganztäg. Zeitentnahmen lfd. Monat",null,{"$f":"VLOOKUP($J$4,Tabelle_Kürzel_Abwesenheit,Spalte_U_Monat,FALSE)","v":0},"Urlaub lfd. Monat",{"$f":"VLOOKUP($J$4,Tabelle_Kürzel_Abwesenheit,Spalte_K_Monat,FALSE)","v":0},"krank lfd. Monat"]
[null,null,null,null,null,null,null,null,null,"- Auszahlungen",null,0,{"$f":"VLOOKUP($J$4,Tabelle_Kürzel_Abwesenheit,Spalte_GT_Summe,FALSE)","v":0},"Ganztäg. Zeitentnahmen Jahr",null,{"$f":"VLOOKUP($J$4,Tabelle_Kürzel_Abwesenheit,Spalte_U_Summe,FALSE)","v":0},"Urlaub Jahr",{"$f":"VLOOKUP($J$4,Tabelle_Kürzel_Abwesenheit,Spalte_K_Summe,FALSE)","v":0},"krank Jahr"]
[null,null,null,null,null,null,null,null,null,"Gesamtsaldo",null,{"$f":"SUM(L41:L42)-L43","v":-0.19097222222222227}]
[]
[null,null,"Vorgesetzten-",null,{"$f":"E4","v":"2021-12-31"},null,null,null,{"$f":"I4","v":"Monat:"},null,null,null,null,{"$f":"M4","v":"Vertragliche regelmäßige Wochenarbeitszeit: "},{"$f":"Y5","v":30},{"$f":"P5","v":"Std/Woche"}]
[null,null,"Meldung",null,null,null,null,null,null,{"$f":"J4","v":"März"}]
[null,null,{"$f":"C6","v":"Name:"},{"$f":"D6","v":0},null,null,{"$f":"G6","v":"Vorname:"},{"$f":"H6","v":0},null,null,null,null,{"$f":"M6","v":0}]
[null,null,null,null,null,null,null,null,null,{"$f":"J6","v":"Pers.-Nr.:"},{"$f":"K6","v":0},"Abteilung/Kostenstelle:",null,"Bemerkungen"]
[null,null,{"$f":"C8","v":"Datum"},"Kommen","Gehen","Anwesenh.",{"$f":"G8","v":"Gesamtzeit"},"Mittag","Arbeitszeit",{"$f":"J8","v":"Stunden"},"Bemerkungen"]
[null,null,"Tag","08:00:00","14:35:00","abs. u. TZ","10:00:00","00:35:00","06:00:00",{"$f":"J9","v":"Saldo"},null,"Hinweise",{"$f":"M9","v":"FT/U/GT/SD/K"}]
[{"$f":"A10","v":"So"},"0:00","2022-02-28",{"$f":"IF(D10=0,\" \",IF(OR($A52=\"Sa\",$A52=\"So\",$M52=\"FT\"),D10,IF(D10<$D$84,D10,\" \")))","v":" "},{"$f":"IF(E10=0,\" \",IF(OR($A52=\"Sa\",$A52=\"So\",$M52=\"FT\"),E10,IF(E10>$D$85,E10,\" \")))","v":" "},null,{"$f":"IF(G10=0,\" \",IF(G10-H10-O10>$H$85,G10,\" \"))","v":" "},{"$f":"IF(K10=\"->Pause<-\",\"Pause!\",\"\")","v":""},null,null,{"$f":"IF(G52<>\" \",\"AZ > 10 h\",\" \")","v":" "},{"$f":"IF(ISERROR(VLOOKUP(C52,Feiertage,2,FALSE))=TRUE,IF(E52<>\" \",\"Kommen/Gehen vor/nach 06:30/20:00\",IF(D52<>\" \",\"Kommen/Gehen vor/nach 06:30/20:00\",\" \")),VLOOKUP(C52,Feiertage,2,FALSE))","v":" "},{"$f":"IF(Y10>0,Y10,\" \")","v":""},null,null,null,null,null,null,null,null,null,null,null,{"$f":"Y10","v":""}]
["Mo","06:00:00","2022-03-01"," "," ",null," ",{"$f":"IF(K11=\"->Pause<-\",\"Pause!\",\"\")","v":""},null,null," "," ",{"$f":"IF(Y11>0,Y11,\" \")","v":""},null,null,null,null,null,null,null,null,null,null,null,""]
["Di","06:00:00","2022-03-02"," "," ",null," ","",null,null," "," ","",null,null,null,null,null,null,null,null,null,null,null,""]
["Mi","06:00:00","2022-03-03"," "," ",null," ","",null,null," "," ","",null,null,null,null,null,null,null,null,null,null,null,""]
["Do","06:00:00","2022-03-04"," "," ",null," ","",null,null," "," ","",null,null,null,null,null,null,null,null,null,null,null,""]
["Fr","06:00:00","2022-03-05"," "," ",null," ","",null,null," "," ","",null,null,null,null,null,null,null,null,null,null,null,""]
["Sa","0:00","2022-03-06"," "," ",null," ","",null,null," "," ","",null,null,null,null,null,null,null,null,null,null,null,""]
["So","0:00","2022-03-07"," "," ",null," ","",null,null," "," ","",null,null,null,null,null,null,null,null,null,null,null,""]
["Mo","06:00:00","2022-03-08"," "," ",null," ","",null,null," "," ","",null,null,null,null,null,null,null,null,null,null,null,""]
["Di","06:00:00","2022-03-09"," "," ",null," ","",null,null," "," ","",null,null,null,null,null,null,null,null,null,null,null,""]
["Mi","06:00:00","2022-03-10"," "," ",null," ","",null,null," "," ","",null,null,null,null,null,null,null,null,null,null,null,""]
["Do","06:00:00","2022-03-11"," "," ",null," ","",null,null," "," ","",null,null,null,null,null,null,null,null,null,null,null,""]
["Fr","06:00:00","2022-03-12"," "," ",null," ","",null,null," "," ","",null,null,null,null,null,null,null,null,null,null,null,""]
["Sa","0:00","2022-03-13"," "," ",null," ","",null,null," "," ","",null,null,null,null,null,null,null,null,null,null,null,""]
["So","0:00","2022-03-14"," "," ",null," ","",null,null," "," ","",null,null,null,null,null,null,null,null,null,null,null,""]
["Mo","06:00:00","2022-03-15"," "," ",null," ","",null,null," "," ","",null,null,null,null,null,null,null,null,null,null,null,""]
["Di","06:00:00","2022-03-16"," "," ",null," ","",null,null," "," ","",null,null,null,null,null,null,null,null,null,null,null,""]
["Mi","06:00:00","2022-03-17"," "," ",null," ","",null,null," "," ","",null,null,null,null,null,null,null,null,null,null,null,""]
["Do","06:00:00","2022-03-18"," "," ",null," ","",null,null," "," ","",null,null,null,null,null,null,null,null,null,null,null,""]
["Fr","06:00:00","2022-03-19"," "," ",null," ","",null,null," "," ","",null,null,null,null,null,null,null,null,null,null,null,""]
["Sa","0:00","2022-03-20"," "," ",null,{"$f":"IF(G30=0,\" \",IF(G30-H30-O30>$H$85,G30,\" \"))","v":" "},"",null,null," "," ","",null,null,null,null,null,null,null,null,null,null,null,""]
["So","0:00","2022-03-21"," "," ",null,{"$f":"IF(G31=0,\" \",IF(G31-H31-O31>$H$85,G31,\" \"))","v":" "},"",null,null,{"$f":"IF(G73<>\" \",\"AZ > 10 h\",\" \")","v":" "}," ","",null,null,null,null,null,null,null,null,null,null,null,""]
["Mo","06:00:00","2022-03-22"," "," ",null," ","",null,null," "," ","",null,null,null,null,null,null,null,null,null,null,null,""]
["Di","06:00:00","2022-03-23"," "," ",null," ","",null,null," "," ","",null,null,null,null,null,null,null,null,null,null,null,""]
["Mi","06:00:00","2022-03-24"," "," ",null," ","",null,null," "," ","",null,null,null,null,null,null,null,null,null,null,null,""]
["Do","06:00:00","2022-03-25"," "," ",null," ","",null,null," "," ","",null,null,null,null,null,null,null,null,null,null,null,""]
["Fr","06:00:00","2022-03-26"," "," ",null," ","",null,null," "," ","",null,null,null,null,null,null,null,null,null,null,null,""]
["Sa","0:00","2022-03-27"," "," ",null," ","",null,null," "," ","",null,null,null,null,null,null,null,null,null,null,null,""]
["So","0:00","2022-03-28"," "," ",null," ","",null,null," "," ","",null,null,null,null,null,null,null,null,null,null,null,""]
["Mo","06:00:00","2022-03-29"," "," ",null," ","",null,null," "," ","",null,null,null,null,null,null,null,null,null,null,null,""]
["Di","06:00:00","2022-03-30"," "," ",null," ","",null,null," "," ","",null,null,null,null,null,null,null,null,null,null,null,""]
[null,null,"Meldegründe:",null,null,null,null,null,null,null,{"$f":"K41","v":"Mon.saldo"}]
[null,null,"vor","06:30:00",null,null,"Über 60 Stunden",{"$f":"H85*6","v":2.5},"Gesamtsaldo",{"$f":"J42","v":"+ Saldo / Vormonate"},null,null,{"$f":"M42","v":0},{"$f":"N42","v":"Ganztäg. Zeitentnahmen lfd. Monat"}]
[null,null,"nach ","20:00:00",null,null,"Über",{"$f":"G9","v":"10:00:00"},"Std. tägl.","- Auszahlungen",null,{"$f":"L43","v":0},{"$f":"M43","v":0},{"$f":"N43","v":"Ganztäg. Zeitentnahmen Jahr"}]
[{"$f":"Januar!A87","v":"V 2026.1"},null,{"$f":"\"mobile Work / Telearbeit: \"&IF(H4=\"Ja\",'mW-HO'!I37&\"%\",\"n.a.\")","v":"mobile Work / Telearbeit: 0%"},null,null,null,"unter -20 Stunden",{"$f":"-H85*2","v":-0.83333333333333337},"Gesamtsaldo",{"$f":"J44","v":"Gesamtsaldo"},null,{"$f":"IF(H84>L44,\" \",L44)","v":" "}]
[null,null,null,null,null,null,null,null,null,null,null,{"$f":"IF(H86>L44,L44,\" \")","v":" "}]

{"sheet":"April","index":4,"n_rows":87,"n_cols":27,"rows_kept":87,"cut":false,"hidden":false,"merged":[[7,19,7,22],[7,15,7,18],[85,2,85,4],[6,11,6,13],[0,0,0,1],[1,0,1,1],[48,3,48,4],[48,7,48,8],[5,7,5,8],[5,3,5,4],[3,5,3,6]]}
[{"$f":"L44","v":-0.19097222222222227},null,"Gesamtsaldo",null,null,null,null,null,null,null,null,null,null,null,null,"Tages-","Mo",{"$f":"INDIRECT(\"'\"&$Y$2&\"'!\"&CELL(\"address\",R1))","v":0.25},null,null,null,null,null,null,"Hilfsspalte","Urlaubstage"]
[{"$f":"L41","v":0},null,"Dieser Monat",null,null,null,null,null,null,null,null,null,null,null,null,"arbeitszeit","Di",0.25,null,null,null,null,null,null,"März"]
[null,null,null,null,null,null,null,null,null,null,null,null,null,null,null,null,"Mi",0.25]
[null,null,"Anwesenheitsliste",null,{"$f":"Januar!E4","v":"2021-12-31"},"Report HO/mW Stat.:",null,"Ja","Monat:",{"$f":"VLOOKUP(MONTH(C10),Text_Monatsname,2,FALSE)","v":"April"},null,null,"Vertragliche regelmäßige Wochenarbeitszeit: ","\"hh:mm\"",{"$f":"IF(INDIRECT(\"'\"&$Y$2&\"'!\"&CELL(\"address\",O4))=\"\",\"\",INDIRECT(\"'\"&$Y$2&\"'!\"&CELL(\"address\",O4)))","v":1.25},null,"Do",0.25,null,null,null,null,null,null,{"$f":"Y5*Y6","v":1.25}]
[null,null,null,null,null,null,null,null,null,null,null,null,null,"oder: Industrieminuten \"hh,<1/10 h>\"",{"$f":"IF(INDIRECT(\"'\"&$Y$2&\"'!\"&CELL(\"address\",O5))=\"\",\"\",INDIRECT(\"'\"&$Y$2&\"'!\"&CELL(\"address\",O5)))","v":""},"Std/Woche","Fr",0.25,{"$f":"SUM(R1:R7)","v":1.25},null,null,null,null,null,{"$f":"IF(O4<>\"\",IF(O5=\"\",(DAY(O4)*24-24)+HOUR(O4)+MINUTE(O4)/60,IF(O5*Y6=O4,O5,\"Fehler\")),IF(O5<>\"\",O5,\"Fehler\"))","v":30}]
[null,null,"Name:",{"$f":"INDIRECT(\"'\"&$Y$2&\"'!\"&CELL(\"address\",D6))","v":0},null,null,"Vorname:",{"$f":"INDIRECT(\"'\"&$Y$2&\"'!\"&CELL(\"address\",H6))","v":0},null,"Pers.-Nr.:",{"$f":"INDIRECT(\"'\"&$Y$2&\"'!\"&CELL(\"address\",K6))","v":0},"Abteilung/Kostenstelle:",{"$f":"INDIRECT(\"'\"&$Y$2&\"'!\"&CELL(\"address\",M6))","v":0},null,{"$f":"IF(Y5=\"Fehler\",\"nur ein Wert!\",\"\")","v":""},"Mittagspause","Sa",0,{"$f":"IF(Y4=S5,\"Saldo O.K.\",\"Saldo falsch\")","v":"Saldo O.K."},null,null,null,null,null,"01:00:00"]
[null,null,null,null,null,null,null,null,null,null,null,"Mittagspause (Ja / Nein)  ",null,null,{"$f":"INDIRECT(\"'\"&$Y$2&\"'!\"&CELL(\"address\",O7))","v":"Ja"},{"$f":"INDIRECT(\"'\"&$Y$2&\"'!\"&CELL(\"address\",P7))","v":"00:35:00"},"So",0]
[null,"Soll","Datum","Kommen","Gehen","Anwesenh.","Gesamtzeit","Mittag","Arbeitszeit","Stunden","Bemerkungen",null,"Dienstl./Sonstige Abwesenheit",null,null,"Dokumentation sonstige Abwesenheit",null,null,null,"zusätzliche Reisezeit"]
[null,"Std","Tag","08:00:00",{"$f":"D9+I9+H9","v":"14:35:00"},"abs. u. TZ","10:00:00",{"$f":"IF(O7=\"NEIN\",0,P7)","v":"00:35:00"},{"$f":"Y4/5","v":"06:00:00"},"Saldo",null,"Hinweise","FT/U/GT/SD/K","SAR","Korrektur","von","bis","von","bis","von","bis","von","bis",null,null,{"$f":"VLOOKUP(J4,Werte_UrlaubstageProMonat,2,FALSE)","v":0}]
[{"$f":"VLOOKUP(WEEKDAY(C10,2),Text_Wochentag,2)","v":"Mi"},{"$f":"IF(OR(A10=\"Sa\",A10=\"So\"),\"0:00\",IF(Y10=\"FT\",\"0:00\",$I$9))","v":"06:00:00"},{"$f":"März!C40+1","v":"2022-03-31"},"00:00:00","00:00:00",null,{"$f":"IF(I10=\" \",0,I10 + IF(N10=\"Ja\", (U10-T10) + (W10-V10),0))","v":0},{"$f":"$H$9","v":"00:35:00"},{"$f":"IFERROR(IF(E10=0,IF(D10=0,\" \",E10-D10+F10-H10),TIME(HOUR(E10-D10+F10),MINUTE(E10-D10+F10),0)-H10) - IF(N10=\"Ja\",(Q10-P10) + (S10-R10),0),\" \")","v":" "},{"$f":"IF(Y10=\"GT\",-B10,IF(E10>0,G10-B10,IF(F10>0,G10-B10,\"     ---   \")))","v":"     ---   "},{"$f":"IF(G10<0,$I$9+D10+H10+O10, IFERROR(IF(OR(AND((I10*24)>9,((H10+IF(N10=\"Ja\",(Q10-P10)+(S10-R10),0))*24*60)<45),AND((I10*24)>6,((H10+IF(N10=\"Ja\",(Q10-P10)+(S10-R10),0))*24*60)<30)),\"->Pause<-\",\"\"),\"\"))","v":""},{"$f":"IF(ISERROR(VLOOKUP(C10,Feiertage,2,FALSE))=TRUE,IF(G10<0,\"Uhr  mind. Arbeitszeit\",IF(AND(I10<>\" \",I10>$G$9),\"Arbeitszeit >10 Std.\",\" \")),VLOOKUP(C10,Feiertage,2,FALSE))","v":" "},{"$f":"IF(ISERROR(VLOOKUP(C10,Feiertage,2,FALSE))=TRUE,\"\",\"FT\")","v":""},null,{"$f":"IF(N10=\"Ja\",((U10-T10)+(W10-V10))-((Q10-P10)+(S10-R10)),0)","v":0},null,null,null,null,null,null,null,null,null,{"$f":"UPPER(TRIM(M10))","v":""},{"$f":"IF(AA10=\"\",\"\",MAX(Z$9:Z9)+1)","v":""},{"$f":"IF(M10=\"U\",C10,\"\")","v":""}]
["Do","06:00:00",{"$f":"C10+1","v":"2022-04-01"},"00:00:00","00:00:00",null,{"$f":"IF(I11=\" \",0,I11 + IF(N11=\"Ja\", (U11-T11) + (W11-V11),0))","v":0},"00:35:00",{"$f":"IFERROR(IF(E11=0,IF(D11=0,\" \",E11-D11+F11-H11),TIME(HOUR(E11-D11+F11),MINUTE(E11-D11+F11),0)-H11) - IF(N11=\"Ja\",(Q11-P11) + (S11-R11),0),\" \")","v":" "},{"$f":"IF(Y11=\"GT\",-B11,IF(E11>0,G11-B11,IF(F11>0,G11-B11,\"     ---   \")))","v":"     ---   "},{"$f":"IF(G11<0,$I$9+D11+H11+O11, IFERROR(IF(OR(AND((I11*24)>9,((H11+IF(N11=\"Ja\",(Q11-P11)+(S11-R11),0))*24*60)<45),AND((I11*24)>6,((H11+IF(N11=\"Ja\",(Q11-P11)+(S11-R11),0))*24*60)<30)),\"->Pause<-\",\"\"),\"\"))","v":""}," ","",null,{"$f":"IF(N11=\"Ja\",((U11-T11)+(W11-V11))-((Q11-P11)+(S11-R11)),0)","v":0},null,null,null,null,null,null,null,null,null,"",{"$f":"IF(AA11=\"\",\"\",MAX(Z$9:Z10)+1)","v":""},""]
["Fr","0:00","2022-04-02","00:00:00","00:00:00",null,"00:00:00","00:35:00"," ","     ---   ","","Karfreitag ","FT",null,0,null,null,null,null,null,null,null,null,null,"FT",{"$f":"IF(AA12=\"\",\"\",MAX(Z$9:Z11)+1)","v":""},""]
["Sa","0:00","2022-04-03","00:00:00","00:00:00",null,"00:00:00","00:35:00"," ","     ---   ",""," ","",null,0,null,null,null,null,null,null,null,null,null,"",{"$f":"IF(AA13=\"\",\"\",MAX(Z$9:Z12)+1)","v":""},""]
["So","0:00","2022-04-04","00:00:00","00:00:00",null,"00:00:00","00:35:00"," ","     ---   ","","Ostersonntag","FT",null,0,null,null,null,null,null,null,null,null,null,"FT",{"$f":"IF(AA14=\"\",\"\",MAX(Z$9:Z13)+1)","v":""},""]
["Mo","0:00","2022-04-05","00:00:00","00:00:00",null,"00:00:00","00:35:00"," ","     ---   ","","Ostermontag","FT",null,0,null,null,null,null,null,null,null,null,null,"FT",{"$f":"IF(AA15=\"\",\"\",MAX(Z$9:Z14)+1)","v":""},""]
["Di","06:00:00","2022-04-06","00:00:00","00:00:00",null,0,"00:35:00"," ","     ---   ",""," ","",null,0,null,null,null,null,null,null,null,null,null,"",{"$f":"IF(AA16=\"\",\"\",MAX(Z$9:Z15)+1)","v":""},""]
["Mi","06:00:00","2022-04-07","00:00:00","00:00:00",null,0,"00:35:00"," ","     ---   ",""," ","",null,0,null,null,null,null,null,null,null,null,null,"",{"$f":"IF(AA17=\"\",\"\",MAX(Z$9:Z16)+1)","v":""},""]
["Do","06:00:00","2022-04-08","00:00:00","00:00:00",null,0,"00:35:00"," ","     ---   ",""," ","",null,0,null,null,null,null,null,null,null,null,null,"",{"$f":"IF(AA18=\"\",\"\",MAX(Z$9:Z17)+1)","v":""},""]
["Fr","06:00:00","2022-04-09","00:00:00","00:00:00",null,0,"00:35:00"," ","     ---   ",""," ","",null,0,null,null,null,null,null,null,null,null,null,"",{"$f":"IF(AA19=\"\",\"\",MAX(Z$9:Z18)+1)","v":""},""]
["Sa","0:00","2022-04-10","00:00:00","00:00:00",null,"00:00:00","00:35:00"," ","     ---   ",""," ","",null,0,null,null,null,null,null,null,null,null,null,"",{"$f":"IF(AA20=\"\",\"\",MAX(Z$9:Z19)+1)","v":""},""]
["So","0:00","2022-04-11","00:00:00","00:00:00",null,"00:00:00","00:35:00"," ","     ---   ",""," ","",null,0,null,null,null,null,null,null,null,null,null,"",{"$f":"IF(AA21=\"\",\"\",MAX(Z$9:Z20)+1)","v":""},""]
["Mo","06:00:00","2022-04-12","00:00:00","00:00:00",null,0,"00:35:00"," ","     ---   ",""," ","",null,0,null,null,null,null,null,null,null,null,null,"",{"$f":"IF(AA22=\"\",\"\",MAX(Z$9:Z21)+1)","v":""},""]
["Di","06:00:00","2022-04-13","00:00:00","00:00:00",null,0,"00:35:00"," ","     ---   ",""," ","",null,0,null,null,null,null,null,null,null,null,null,"",{"$f":"IF(AA23=\"\",\"\",MAX(Z$9:Z22)+1)","v":""},""]
["Mi","06:00:00","2022-04-14","00:00:00","00:00:00",null,0,"00:35:00"," ","     ---   ",""," ","",null,0,null,null,null,null,null,null,null,null,null,"",{"$f":"IF(AA24=\"\",\"\",MAX(Z$9:Z23)+1)","v":""},""]
["Do","06:00:00","2022-04-15","00:00:00","00:00:00",null,0,"00:35:00"," ","     ---   ",""," ","",null,0,null,null,null,null,null,null,null,null,null,"",{"$f":"IF(AA25=\"\",\"\",MAX(Z$9:Z24)+1)","v":""},""]
["Fr","06:00:00","2022-04-16","00:00:00","00:00:00",null,0,"00:35:00"," ","     ---   ",""," ",null,null,0,null,null,null,null,null,null,null,null,null,"",{"$f":"IF(AA26=\"\",\"\",MAX(Z$9:Z25)+1)","v":""},""]
["Sa","0:00","2022-04-17","00:00:00","00:00:00",null,"00:00:00","00:35:00"," ","     ---   ",""," ","",null,0,null,null,null,null,null,null,null,null,null,"",{"$f":"IF(AA27=\"\",\"\",MAX(Z$9:Z26)+1)","v":""},""]
["So","0:00","2022-04-18","00:00:00","00:00:00",null,"00:00:00","00:35:00"," ","     ---   ",""," ","",null,0,null,null,null,null,null,null,null,null,null,"",{"$f":"IF(AA28=\"\",\"\",MAX(Z$9:Z27)+1)","v":""},""]
["Mo","06:00:00","2022-04-19","00:00:00","00:00:00",null,0,"00:35:00"," ","     ---   ",""," ","",null,0,null,null,null,null,null,null,null,null,null,"",{"$f":"IF(AA29=\"\",\"\",MAX(Z$9:Z28)+1)","v":""},""]
["Di","06:00:00","2022-04-20","00:00:00","00:00:00",null,0,"00:35:00"," ","     ---   ",""," ","",null,0,null,null,null,null,null,null,null,null,null,"",{"$f":"IF(AA30=\"\",\"\",MAX(Z$9:Z29)+1)","v":""},""]
["Mi","06:00:00","2022-04-21","00:00:00","00:00:00",null,0,"00:35:00"," ","     ---   ",""," ","",null,0,null,null,null,null,null,null,null,null,null,"",{"$f":"IF(AA31=\"\",\"\",MAX(Z$9:Z30)+1)","v":""},""]
["Do","06:00:00","2022-04-22","00:00:00","00:00:00",null,0,"00:35:00"," ","     ---   ",""," ",null,null,0,null,null,null,null,null,null,null,null,null,"",{"$f":"IF(AA32=\"\",\"\",MAX(Z$9:Z31)+1)","v":""},""]
["Fr","06:00:00","2022-04-23","00:00:00","00:00:00",null,0,"00:35:00"," ","     ---   ",""," ","",null,0,null,null,null,null,null,null,null,null,null,"",{"$f":"IF(AA33=\"\",\"\",MAX(Z$9:Z32)+1)","v":""},""]
["Sa","0:00","2022-04-24","00:00:00","00:00:00",null,"00:00:00","00:35:00"," ","     ---   ",""," ","",null,0,null,null,null,null,null,null,null,null,null,"",{"$f":"IF(AA34=\"\",\"\",MAX(Z$9:Z33)+1)","v":""},""]
["So","0:00","2022-04-25","00:00:00","00:00:00",null,"00:00:00","00:35:00"," ","     ---   ",""," ","",null,0,null,null,null,null,null,null,null,null,null,"",{"$f":"IF(AA35=\"\",\"\",MAX(Z$9:Z34)+1)","v":""},""]
["Mo","06:00:00","2022-04-26","00:00:00","00:00:00",null,0,"00:35:00"," ","     ---   ",""," ","",null,0,null,null,null,null,null,null,null,null,null,"",{"$f":"IF(AA36=\"\",\"\",MAX(Z$9:Z35)+1)","v":""},""]
["Di","06:00:00","2022-04-27","00:00:00","00:00:00",null,0,"00:35:00"," ","     ---   ",""," ","",null,0,null,null,null,null,null,null,null,null,null,"",{"$f":"IF(AA37=\"\",\"\",MAX(Z$9:Z36)+1)","v":""},""]
["Mi","06:00:00","2022-04-28","00:00:00","00:00:00",null,0,"00:35:00"," ","     ---   ",""," ","",null,0,null,null,null,null,null,null,null,null,null,"",{"$f":"IF(AA38=\"\",\"\",MAX(Z$9:Z37)+1)","v":""},""]
["Do","06:00:00","2022-04-29","00:00:00","00:00:00",null,0,"00:35:00"," ","     ---   ",""," ","",null,0,null,null,null,null,null,null,null,null,null,"",{"$f":"IF(AA39=\"\",\"\",MAX(Z$9:Z38)+1)","v":""},""]
[null,null,null,null,null,null,null,null,null,null,null,{"$f":"IF(ISERROR(VLOOKUP(C40,Feiertage,2,FALSE))=TRUE,IF(G40<0,\"Uhr  Februar!mind. Arbeitszeit\",IF((G40-H40-O40)>$G$9,\"Arbeitszeit >10 Std.\",\" \")),VLOOKUP(C40,Feiertage,2,FALSE))","v":" "}]
[null,null,null,null,null,null,null,null,null,{"$f":"SUM(J10:J39)","v":0},"Mon.saldo",{"$f":"J41","v":0},null,null,null,null,null,null,null,null,null,null,null,null,null,{"$f":"IF(AA41=\"\",\"\",MAX(Z$9:Z39)+1)","v":""},{"$f":"IF(M41=\"U\",C41,\"\")","v":""}]
[null,null,null,null,null,null,null,null,null,"+ Saldo / Vormonate",null,{"$f":"März!L44","v":-0.19097222222222227},{"$f":"VLOOKUP($J$4,Tabelle_Kürzel_Abwesenheit,Spalte_GT_Monat,FALSE)","v":0},"Ganztäg. Zeitentnahmen lfd. Monat",null,{"$f":"VLOOKUP($J$4,Tabelle_Kürzel_Abwesenheit,Spalte_U_Monat,FALSE)","v":0},"Urlaub lfd. Monat",{"$f":"VLOOKUP($J$4,Tabelle_Kürzel_Abwesenheit,Spalte_K_Monat,FALSE)","v":0},"krank lfd. Monat",null,null,null,null,null,null,{"$f":"MAX(Z9:Z41)","v":0},{"$f":"COUNT(AA10:AA41)","v":0}]
[null,null,null,null,null,null,null,null,null,"- Auszahlungen",null,0,{"$f":"VLOOKUP($J$4,Tabelle_Kürzel_Abwesenheit,Spalte_GT_Summe,FALSE)","v":0},"Ganztäg. Zeitentnahmen Jahr",null,{"$f":"VLOOKUP($J$4,Tabelle_Kürzel_Abwesenheit,Spalte_U_Summe,FALSE)","v":0},"Urlaub Jahr",{"$f":"VLOOKUP($J$4,Tabelle_Kürzel_Abwesenheit,Spalte_K_Summe,FALSE)","v":0},"krank Jahr"]
[null,null,null,null,null,null,null,null,null,"Gesamtsaldo",null,{"$f":"SUM(L41:L42)-L43","v":-0.19097222222222227}]
[]
[]
[null,null,"Vorgesetzten-",null,{"$f":"E4","v":"2021-12-31"},null,null,null,{"$f":"I4","v":"Monat:"},null,null,null,null,{"$f":"M4","v":"Vertragliche regelmäßige Wochenarbeitszeit: "},{"$f":"Y5","v":30},{"$f":"P5","v":"Std/Woche"}]
[null,null,"Meldung",null,null,null,null,null,null,{"$f":"J4","v":"April"}]
[null,null,{"$f":"C6","v":"Name:"},{"$f":"D6","v":0},null,null,{"$f":"G6","v":"Vorname:"},{"$f":"H6","v":0},null,null,null,null,{"$f":"M6","v":0}]
[null,null,null,null,null,null,null,null,null,{"$f":"J6","v":"Pers.-Nr.:"},{"$f":"K6","v":0},"Abteilung/Kostenstelle:",null,"Bemerkungen"]
[null,null,{"$f":"C8","v":"Datum"},"Kommen","Gehen","Anwesenh.",{"$f":"G8","v":"Gesamtzeit"},"Mittag","Arbeitszeit",{"$f":"J8","v":"Stunden"},"Bemerkungen"]
[null,null,"Tag","08:00:00","14:35:00","abs. u. TZ","10:00:00","00:35:00","06:00:00",{"$f":"J9","v":"Saldo"},null,"Hinweise",{"$f":"M9","v":"FT/U/GT/SD/K"}]
[{"$f":"A10","v":"Mi"},"06:00:00","2022-03-31",{"$f":"IF(D10=0,\" \",IF(OR($A53=\"Sa\",$A53=\"So\",$M53=\"FT\"),D10,IF(D10<$D$84,D10,\" \")))","v":" "},{"$f":"IF(E10=0,\" \",IF(OR($A53=\"Sa\",$A53=\"So\",$M53=\"FT\"),E10,IF(E10>$D$85,E10,\" \")))","v":" "},null,{"$f":"IF(G10=0,\" \",IF(G10-H10-O10>$H$86,G10,\" \"))","v":" "},{"$f":"IF(K10=\"->Pause<-\",\"Pause!\",\"\")","v":""},null,null,{"$f":"IF(G53<>\" \",\"AZ > 10 h\",\" \")","v":" "},{"$f":"IF(ISERROR(VLOOKUP(C53,Feiertage,2,FALSE))=TRUE,IF(E53<>\" \",\"Kommen/Gehen vor/nach 06:30/20:00\",IF(D53<>\" \",\"Kommen/Gehen vor/nach 06:30/20:00\",\" \")),VLOOKUP(C53,Feiertage,2,FALSE))","v":" "},{"$f":"IF(Y10>0,Y10,\" \")","v":""},null,null,null,null,null,null,null,null,null,null,null,{"$f":"Y10","v":""}]
["Do","06:00:00","2022-04-01"," "," ",null," ",{"$f":"IF(K11=\"->Pause<-\",\"Pause!\",\"\")","v":""},null,null," "," ",{"$f":"IF(Y11>0,Y11,\" \")","v":""},null,null,null,null,null,null,null,null,null,null,null,""]
["Fr","0:00","2022-04-02"," "," ",null," ","",null,null," ","Karfreitag ","FT",null,null,null,null,null,null,null,null,null,null,null,"FT"]
["Sa","0:00","2022-04-03"," "," ",null," ","",null,null," "," ","",null,null,null,null,null,null,null,null,null,null,null,""]
["So","0:00","2022-04-04"," "," ",null," ","",null,null," ","Ostersonntag","FT",null,null,null,null,null,null,null,null,null,null,null,"FT"]
["Mo","0:00","2022-04-05"," "," ",null," ","",null,null," ","Ostermontag","FT",null,null,null,null,null,null,null,null,null,null,null,"FT"]
["Di","06:00:00","2022-04-06"," "," ",null," ","",null,null," "," ","",null,null,null,null,null,null,null,null,null,null,null,""]
["Mi","06:00:00","2022-04-07"," "," ",null," ","",null,null," "," ","",null,null,null,null,null,null,null,null,null,null,null,""]
["Do","06:00:00","2022-04-08"," "," ",null," ","",null,null," "," ","",null,null,null,null,null,null,null,null,null,null,null,""]
["Fr","06:00:00","2022-04-09"," "," ",null," ","",null,null," "," ","",null,null,null,null,null,null,null,null,null,null,null,""]
["Sa","0:00","2022-04-10"," "," ",null," ","",null,null," "," ","",null,null,null,null,null,null,null,null,null,null,null,""]
["So","0:00","2022-04-11"," "," ",null," ","",null,null," "," ","",null,null,null,null,null,null,null,null,null,null,null,""]
["Mo","06:00:00","2022-04-12"," "," ",null," ","",null,null," "," ","",null,null,null,null,null,null,null,null,null,null,null,""]
["Di","06:00:00","2022-04-13"," "," ",null," ","",null,null," "," ","",null,null,null,null,null,null,null,null,null,null,null,""]
["Mi","06:00:00","2022-04-14"," "," ",null," ","",null,null," "," ","",null,null,null,null,null,null,null,null,null,null,null,""]
["Do","06:00:00","2022-04-15"," "," ",null," ","",null,null," "," ","",null,null,null,null,null,null,null,null,null,null,null,""]
["Fr","06:00:00","2022-04-16"," "," ",null," ","",null,null," "," ","",null,null,null,null,null,null,null,null,null,null,null,""]
["Sa","0:00","2022-04-17"," "," ",null," ","",null,null," "," ","",null,null,null,null,null,null,null,null,null,null,null,""]
["So","0:00","2022-04-18"," "," ",null," ","",null,null," "," ","",null,null,null,null,null,null,null,null,null,null,null,""]
["Mo","06:00:00","2022-04-19"," "," ",null," ","",null,null," "," ","",null,null,null,null,null,null,null,null,null,null,null,""]
["Di","06:00:00","2022-04-20"," "," ",null," ","",null,null," "," ","",null,null,null,null,null,null,null,null,null,null,null,""]
["Mi","06:00:00","2022-04-21"," "," ",null," ","",null,null," "," ","",null,null,null,null,null,null,null,null,null,null,null,""]
["Do","06:00:00","2022-04-22"," "," ",null," ","",null,null," "," ","",null,null,null,null,null,null,null,null,null,null,null,""]
["Fr","06:00:00","2022-04-23"," "," ",null," ","",null,null," "," ","",null,null,null,null,null,null,null,null,null,null,null,""]
["Sa","0:00","2022-04-24"," "," ",null," ","",null,null," "," ","",null,null,null,null,null,null,null,null,null,null,null,""]
[{"$f":"A35","v":"So"},"0:00","2022-04-25"," "," ",null," ","",null,null," "," ","",null,null,null,null,null,null,null,null,null,null,null,""]
["Mo","06:00:00","2022-04-26"," "," ",null," ","",null,null," "," ","",null,null,null,null,null,null,null,null,null,null,null,""]
["Di","06:00:00","2022-04-27"," "," ",null," ","",null,null," "," ","",null,null,null,null,null,null,null,null,null,null,null,""]
[{"$f":"A38","v":"Mi"},"06:00:00","2022-04-28"," "," ",null," ","",null,null," "," ","",null,null,null,null,null,null,null,null,null,null,null,""]
["Do","06:00:00","2022-04-29"," "," ",null," ","",null,null," "," ","",null,null,null,null,null,null,null,null,null,null,null,""]
[null,null,"Meldegründe:",null,null,null,null,null,null,null,{"$f":"K41","v":"Mon.saldo"}]
[null,null,"vor","06:30:00",null,null,null,null,"Gesamtsaldo",{"$f":"J42","v":"+ Saldo / Vormonate"},null,null,{"$f":"M42","v":0},{"$f":"N42","v":"Ganztäg. Zeitentnahmen lfd. Monat"}]
[null,null,"nach ","20:00:00",null,null,"Über 60 Stunden",{"$f":"H86*6","v":2.5},null,"- Auszahlungen",null,{"$f":"L43","v":0},{"$f":"M43","v":0},{"$f":"N43","v":"Ganztäg. Zeitentnahmen Jahr"}]
[{"$f":"Januar!A87","v":"V 2026.1"},null,{"$f":"\"mobile Work / Telearbeit: \"&IF(H4=\"Ja\",'mW-HO'!L37&\"%\",\"n.a.\")","v":"mobile Work / Telearbeit: 0%"},null,null,null,"Über",{"$f":"G9","v":"10:00:00"},"Std. tägl.",{"$f":"J44","v":"Gesamtsaldo"},null,{"$f":"IF(H85>L44,\" \",L44)","v":" "}]
[null,null,null,null,null,null,"unter -20 Stunden",{"$f":"-H86*2","v":-0.83333333333333337},"Gesamtsaldo",null,null,{"$f":"IF(H87>L44,L44,\" \")","v":" "}]

{"sheet":"Mai","index":5,"n_rows":87,"n_cols":27,"rows_kept":87,"cut":false,"hidden":false,"merged":[[7,19,7,22],[7,15,7,18],[85,2,85,4],[6,11,6,13],[0,0,0,1],[1,0,1,1],[47,3,47,4],[47,7,47,8],[5,7,5,8],[5,3,5,4],[3,5,3,6]]}
[{"$f":"L44","v":-0.19097222222222227},null,"Gesamtsaldo",null,null,null,null,null,null,null,null,null,null,null,null,"Tages-","Mo",{"$f":"INDIRECT(\"'\"&$Y$2&\"'!\"&CELL(\"address\",R1))","v":0.25},null,null,null,null,null,null,"Hilfsspalte","Urlaubstage"]
[{"$f":"L41","v":0},null,"Dieser Monat",null,null,null,null,null,null,null,null,null,null,null,null,"arbeitszeit","Di",0.25,null,null,null,null,null,null,"April"]
[null,null,null,null,null,null,null,null,null,null,null,null,null,null,null,null,"Mi",0.25]
[null,null,"Anwesenheitsliste",null,{"$f":"Januar!E4","v":"2021-12-31"},"Report HO/mW Stat.:",null,"Ja","Monat:",{"$f":"VLOOKUP(MONTH(C10),Text_Monatsname,2,FALSE)","v":"Mai"},null,null,"Vertragliche regelmäßige Wochenarbeitszeit: ","\"hh:mm\"",{"$f":"IF(INDIRECT(\"'\"&$Y$2&\"'!\"&CELL(\"address\",O4))=\"\",\"\",INDIRECT(\"'\"&$Y$2&\"'!\"&CELL(\"address\",O4)))","v":1.25},null,"Do",0.25,null,null,null,null,null,null,{"$f":"Y5*Y6","v":1.25}]
[null,null,null,null,null,null,null,null,null,null,null,null,null,"oder: Industrieminuten \"hh,<1/10 h>\"",{"$f":"IF(INDIRECT(\"'\"&$Y$2&\"'!\"&CELL(\"address\",O5))=\"\",\"\",INDIRECT(\"'\"&$Y$2&\"'!\"&CELL(\"address\",O5)))","v":""},"Std/Woche","Fr",0.25,{"$f":"SUM(R1:R7)","v":1.25},null,null,null,null,null,{"$f":"IF(O4<>\"\",IF(O5=\"\",(DAY(O4)*24-24)+HOUR(O4)+MINUTE(O4)/60,IF(O5*Y6=O4,O5,\"Fehler\")),IF(O5<>\"\",O5,\"Fehler\"))","v":30}]
[null,null,"Name:",{"$f":"INDIRECT(\"'\"&$Y$2&\"'!\"&CELL(\"address\",D6))","v":0},null,null,"Vorname:",{"$f":"INDIRECT(\"'\"&$Y$2&\"'!\"&CELL(\"address\",H6))","v":0},null,"Pers.-Nr.:",{"$f":"INDIRECT(\"'\"&$Y$2&\"'!\"&CELL(\"address\",K6))","v":0},"Abteilung/Kostenstelle:",{"$f":"INDIRECT(\"'\"&$Y$2&\"'!\"&CELL(\"address\",M6))","v":0},null,{"$f":"IF(Y5=\"Fehler\",\"nur ein Wert!\",\"\")","v":""},"Mittagspause","Sa",0,{"$f":"IF(Y4=S5,\"Saldo O.K.\",\"Saldo falsch\")","v":"Saldo O.K."},null,null,null,null,null,"01:00:00"]
[null,null,null,null,null,null,null,null,null,null,null,"Mittagspause (Ja / Nein)  ",null,null,{"$f":"INDIRECT(\"'\"&$Y$2&\"'!\"&CELL(\"address\",O7))","v":"Ja"},{"$f":"INDIRECT(\"'\"&$Y$2&\"'!\"&CELL(\"address\",P7))","v":"00:35:00"},"So",0]
[null,"Soll","Datum","Kommen","Gehen","Anwesenh.","Gesamtzeit","Mittag","Arbeitszeit","Stunden","Bemerkungen",null,"Dienstl./Sonstige Abwesenheit",null,null,"Dokumentation sonstige Abwesenheit",null,null,null,"zusätzliche Reisezeit"]
[null,"Std","Tag","08:00:00",{"$f":"D9+I9+H9","v":"14:35:00"},"abs. u. TZ","10:00:00",{"$f":"IF(O7=\"NEIN\",0,P7)","v":"00:35:00"},{"$f":"Y4/5","v":"06:00:00"},"Saldo",null,"Hinweise","FT/U/GT/SD/K","SAR","Korrektur","von","bis","von","bis","von","bis","von","bis",null,null,{"$f":"VLOOKUP(J4,Werte_UrlaubstageProMonat,2,FALSE)","v":0}]
[{"$f":"VLOOKUP(WEEKDAY(C10,2),Text_Wochentag,2)","v":"Fr"},{"$f":"IF(OR(A10=\"Sa\",A10=\"So\"),\"0:00\",IF(Y10=\"FT\",\"0:00\",$I$9))","v":"0:00"},{"$f":"April!C39+1","v":"2022-04-30"},"00:00:00","00:00:00",null,{"$f":"IF(I10=\" \",0,I10 + IF(N10=\"Ja\", (U10-T10) + (W10-V10),0))","v":"00:00:00"},{"$f":"$H$9","v":"00:35:00"},{"$f":"IFERROR(IF(E10=0,IF(D10=0,\" \",E10-D10+F10-H10),TIME(HOUR(E10-D10+F10),MINUTE(E10-D10+F10),0)-H10) - IF(N10=\"Ja\",(Q10-P10) + (S10-R10),0),\" \")","v":" "},{"$f":"IF(Y10=\"GT\",-B10,IF(E10>0,G10-B10,IF(F10>0,G10-B10,\"     ---   \")))","v":"     ---   "},{"$f":"IF(G10<0,$I$9+D10+H10+O10, IFERROR(IF(OR(AND((I10*24)>9,((H10+IF(N10=\"Ja\",(Q10-P10)+(S10-R10),0))*24*60)<45),AND((I10*24)>6,((H10+IF(N10=\"Ja\",(Q10-P10)+(S10-R10),0))*24*60)<30)),\"->Pause<-\",\"\"),\"\"))","v":""},{"$f":"IF(ISERROR(VLOOKUP(C10,Feiertage,2,FALSE))=TRUE,IF(G10<0,\"Uhr  mind. Arbeitszeit\",IF(AND(I10<>\" \",I10>$G$9),\"Arbeitszeit >10 Std.\",\" \")),VLOOKUP(C10,Feiertage,2,FALSE))","v":"Tag der Arbeit"},{"$f":"IF(ISERROR(VLOOKUP(C10,Feiertage,2,FALSE))=TRUE,\"\",\"FT\")","v":"FT"},null,{"$f":"IF(N10=\"Ja\",((U10-T10)+(W10-V10))-((Q10-P10)+(S10-R10)),0)","v":0},null,null,null,null,null,null,null,null,null,{"$f":"UPPER(TRIM(M10))","v":"FT"},{"$f":"IF(AA10=\"\",\"\",MAX(Z$9:Z9)+1)","v":""},{"$f":"IF(M10=\"U\",C10,\"\")","v":""}]
["Sa","0:00",{"$f":"C10+1","v":"2022-05-01"},"00:00:00","00:00:00",null,{"$f":"IF(I11=\" \",0,I11 + IF(N11=\"Ja\", (U11-T11) + (W11-V11),0))","v":"00:00:00"},"00:35:00",{"$f":"IFERROR(IF(E11=0,IF(D11=0,\" \",E11-D11+F11-H11),TIME(HOUR(E11-D11+F11),MINUTE(E11-D11+F11),0)-H11) - IF(N11=\"Ja\",(Q11-P11) + (S11-R11),0),\" \")","v":" "},{"$f":"IF(Y11=\"GT\",-B11,IF(E11>0,G11-B11,IF(F11>0,G11-B11,\"     ---   \")))","v":"     ---   "},{"$f":"IF(G11<0,$I$9+D11+H11+O11, IFERROR(IF(OR(AND((I11*24)>9,((H11+IF(N11=\"Ja\",(Q11-P11)+(S11-R11),0))*24*60)<45),AND((I11*24)>6,((H11+IF(N11=\"Ja\",(Q11-P11)+(S11-R11),0))*24*60)<30)),\"->Pause<-\",\"\"),\"\"))","v":""}," ","",null,{"$f":"IF(N11=\"Ja\",((U11-T11)+(W11-V11))-((Q11-P11)+(S11-R11)),0)","v":0},null,null,null,null,null,null,null,null,null,"",{"$f":"IF(AA11=\"\",\"\",MAX(Z$9:Z10)+1)","v":""},""]
["So","0:00",{"$f":"C11+1","v":"2022-05-02"},"00:00:00","00:00:00",null,"00:00:00","00:35:00"," ","     ---   ",""," ","",null,0,null,null,null,null,null,null,null,null,null,"",{"$f":"IF(AA12=\"\",\"\",MAX(Z$9:Z11)+1)","v":""},""]
["Mo","06:00:00","2022-05-03","00:00:00","00:00:00",null,"00:00:00","00:35:00"," ","     ---   ",""," ","",null,0,null,null,null,null,null,null,null,null,null,"",{"$f":"IF(AA13=\"\",\"\",MAX(Z$9:Z12)+1)","v":""},""]
["Di","06:00:00","2022-05-04","00:00:00","00:00:00",null,"00:00:00","00:35:00"," ","     ---   ",""," ","",null,0,null,null,null,null,null,null,null,null,null,"",{"$f":"IF(AA14=\"\",\"\",MAX(Z$9:Z13)+1)","v":""},""]
["Mi","06:00:00","2022-05-05","00:00:00","00:00:00",null,"00:00:00","00:35:00"," ","     ---   ",""," ","",null,0,null,null,null,null,null,null,null,null,null,"",{"$f":"IF(AA15=\"\",\"\",MAX(Z$9:Z14)+1)","v":""},""]
["Do","06:00:00","2022-05-06","00:00:00","00:00:00",null,"00:00:00","00:35:00"," ","     ---   ",""," ","",null,0,null,null,null,null,null,null,null,null,null,"",{"$f":"IF(AA16=\"\",\"\",MAX(Z$9:Z15)+1)","v":""},""]
["Fr","06:00:00","2022-05-07","00:00:00","00:00:00",null,"00:00:00","00:35:00"," ","     ---   ",""," ","",null,0,null,null,null,null,null,null,null,null,null,"",{"$f":"IF(AA17=\"\",\"\",MAX(Z$9:Z16)+1)","v":""},""]
["Sa","0:00","2022-05-08","00:00:00","00:00:00",null,"00:00:00","00:35:00"," ","     ---   ",""," ","",null,0,null,null,null,null,null,null,null,null,null,"",{"$f":"IF(AA18=\"\",\"\",MAX(Z$9:Z17)+1)","v":""},""]
["So","0:00","2022-05-09","00:00:00","00:00:00",null,"00:00:00","00:35:00"," ","     ---   ",""," ","",null,0,null,null,null,null,null,null,null,null,null,"",{"$f":"IF(AA19=\"\",\"\",MAX(Z$9:Z18)+1)","v":""},""]
["Mo","06:00:00","2022-05-10","00:00:00","00:00:00",null,"00:00:00","00:35:00"," ","     ---   ",""," ","",null,0,null,null,null,null,null,null,null,null,null,"",{"$f":"IF(AA20=\"\",\"\",MAX(Z$9:Z19)+1)","v":""},""]
["Di","06:00:00","2022-05-11","00:00:00","00:00:00",null,"00:00:00","00:35:00"," ","     ---   ",""," ","",null,0,null,null,null,null,null,null,null,null,null,"",{"$f":"IF(AA21=\"\",\"\",MAX(Z$9:Z20)+1)","v":""},""]
["Mi","06:00:00","2022-05-12","00:00:00","00:00:00",null,"00:00:00","00:35:00"," ","     ---   ",""," ","",null,0,null,null,null,null,null,null,null,null,null,"",{"$f":"IF(AA22=\"\",\"\",MAX(Z$9:Z21)+1)","v":""},""]
["Do","0:00","2022-05-13","00:00:00","00:00:00",null,"00:00:00","00:35:00"," ","     ---   ","","Christi Himmelfahrt","FT",null,0,null,null,null,null,null,null,null,null,null,"FT",{"$f":"IF(AA23=\"\",\"\",MAX(Z$9:Z22)+1)","v":""},""]
["Fr","06:00:00","2022-05-14","00:00:00","00:00:00",null,"00:00:00","00:35:00"," ","     ---   ",""," ","",null,0,null,null,null,null,null,null,null,null,null,"",{"$f":"IF(AA24=\"\",\"\",MAX(Z$9:Z23)+1)","v":""},""]
["Sa","0:00","2022-05-15","00:00:00","00:00:00",null,"00:00:00","00:35:00"," ","     ---   ",""," ","",null,0,null,null,null,null,null,null,null,null,null,"",{"$f":"IF(AA25=\"\",\"\",MAX(Z$9:Z24)+1)","v":""},""]
["So","0:00","2022-05-16","00:00:00","00:00:00",null,"00:00:00","00:35:00"," ","     ---   ",""," ","",null,0,null,null,null,null,null,null,null,null,null,"",{"$f":"IF(AA26=\"\",\"\",MAX(Z$9:Z25)+1)","v":""},""]
["Mo","06:00:00","2022-05-17","00:00:00","00:00:00",null,"00:00:00","00:35:00"," ","     ---   ",""," ","",null,0,null,null,null,null,null,null,null,null,null,"",{"$f":"IF(AA27=\"\",\"\",MAX(Z$9:Z26)+1)","v":""},""]
["Di","06:00:00","2022-05-18","00:00:00","00:00:00",null,"00:00:00","00:35:00"," ","     ---   ",""," ","",null,0,null,null,null,null,null,null,null,null,null,"",{"$f":"IF(AA28=\"\",\"\",MAX(Z$9:Z27)+1)","v":""},""]
["Mi","06:00:00","2022-05-19","00:00:00","00:00:00",null,"00:00:00","00:35:00"," ","     ---   ",""," ","",null,0,null,null,null,null,null,null,null,null,null,"",{"$f":"IF(AA29=\"\",\"\",MAX(Z$9:Z28)+1)","v":""},""]
["Do","06:00:00","2022-05-20","00:00:00","00:00:00",null,"00:00:00","00:35:00"," ","     ---   ",""," ","",null,0,null,null,null,null,null,null,null,null,null,"",{"$f":"IF(AA30=\"\",\"\",MAX(Z$9:Z29)+1)","v":""},""]
["Fr","06:00:00","2022-05-21","00:00:00","00:00:00",null,"00:00:00","00:35:00"," ","     ---   ",""," ","",null,0,null,null,null,null,null,null,null,null,null,"",{"$f":"IF(AA31=\"\",\"\",MAX(Z$9:Z30)+1)","v":""},""]
["Sa","0:00","2022-05-22","00:00:00","00:00:00",null,"00:00:00","00:35:00"," ","     ---   ",""," ","",null,0,null,null,null,null,null,null,null,null,null,"",{"$f":"IF(AA32=\"\",\"\",MAX(Z$9:Z31)+1)","v":""},""]
["So","0:00","2022-05-23","00:00:00","00:00:00",null,"00:00:00","00:35:00"," ","     ---   ","","Pfingstsonntag ","FT",null,0,null,null,null,null,null,null,null,null,null,"FT",{"$f":"IF(AA33=\"\",\"\",MAX(Z$9:Z32)+1)","v":""},""]
["Mo","0:00","2022-05-24","00:00:00","00:00:00",null,"00:00:00","00:35:00"," ","     ---   ","","Pfingstmontag ","FT",null,0,null,null,null,null,null,null,null,null,null,"FT",{"$f":"IF(AA34=\"\",\"\",MAX(Z$9:Z33)+1)","v":""},""]
["Di","06:00:00","2022-05-25","00:00:00","00:00:00",null,"00:00:00","00:35:00"," ","     ---   ",""," ","",null,0,null,null,null,null,null,null,null,null,null,"",{"$f":"IF(AA35=\"\",\"\",MAX(Z$9:Z34)+1)","v":""},""]
["Mi","06:00:00","2022-05-26","00:00:00","00:00:00",null,"00:00:00","00:35:00"," ","     ---   ",""," ","",null,0,null,null,null,null,null,null,null,null,null,"",{"$f":"IF(AA36=\"\",\"\",MAX(Z$9:Z35)+1)","v":""},""]
["Do","06:00:00","2022-05-27","00:00:00","00:00:00",null,"00:00:00","00:35:00"," ","     ---   ",""," ","",null,0,null,null,null,null,null,null,null,null,null,"",{"$f":"IF(AA37=\"\",\"\",MAX(Z$9:Z36)+1)","v":""},""]
["Fr","06:00:00","2022-05-28","00:00:00","00:00:00",null,"00:00:00","00:35:00"," ","     ---   ",""," ","",null,0,null,null,null,null,null,null,null,null,null,"",{"$f":"IF(AA38=\"\",\"\",MAX(Z$9:Z37)+1)","v":""},""]
["Sa","0:00","2022-05-29","00:00:00","00:00:00",null,"00:00:00","00:35:00"," ","     ---   ",""," ","",null,0,null,null,null,null,null,null,null,null,null,"",{"$f":"IF(AA39=\"\",\"\",MAX(Z$9:Z38)+1)","v":""},""]
["So","0:00","2022-05-30","00:00:00","00:00:00",null,"00:00:00","00:35:00"," ","     ---   ",""," ","",null,0,null,null,null,null,null,null,null,null,null,"",{"$f":"IF(AA40=\"\",\"\",MAX(Z$9:Z39)+1)","v":""},""]
[null,null,null,null,null,null,null,null,null,{"$f":"SUM(J10:J40)","v":0},"Mon.saldo",{"$f":"J41","v":0},null,null,null,null,null,null,null,null,null,null,null,null,null,{"$f":"MAX(Z9:Z40)","v":0},{"$f":"COUNT(AA10:AA40)","v":0}]
[null,null,null,null,null,null,null,null,null,"+ Saldo / Vormonate",null,{"$f":"April!L44","v":-0.19097222222222227},{"$f":"VLOOKUP($J$4,Tabelle_Kürzel_Abwesenheit,Spalte_GT_Monat,FALSE)","v":0},"Ganztäg. Zeitentnahmen lfd. Monat",null,{"$f":"VLOOKUP($J$4,Tabelle_Kürzel_Abwesenheit,Spalte_U_Monat,FALSE)","v":0},"Urlaub lfd. Monat",{"$f":"VLOOKUP($J$4,Tabelle_Kürzel_Abwesenheit,Spalte_K_Monat,FALSE)","v":0},"krank lfd. Monat"]
[null,null,null,null,null,null,null,null,null,"- Auszahlungen",null,0,{"$f":"VLOOKUP($J$4,Tabelle_Kürzel_Abwesenheit,Spalte_GT_Summe,FALSE)","v":0},"Ganztäg. Zeitentnahmen Jahr",null,{"$f":"VLOOKUP($J$4,Tabelle_Kürzel_Abwesenheit,Spalte_U_Summe,FALSE)","v":0},"Urlaub Jahr",{"$f":"VLOOKUP($J$4,Tabelle_Kürzel_Abwesenheit,Spalte_K_Summe,FALSE)","v":0},"krank Jahr"]
[null,null,null,null,null,null,null,null,null,"Gesamtsaldo",null,{"$f":"SUM(L41:L42)","v":-0.19097222222222227}]
[]
[null,null,"Vorgesetzten-",null,{"$f":"E4","v":"2021-12-31"},null,null,null,{"$f":"I4","v":"Monat:"},null,null,null,null,{"$f":"M4","v":"Vertragliche regelmäßige Wochenarbeitszeit: "},{"$f":"Y5","v":30},{"$f":"P5","v":"Std/Woche"}]
[null,null,"Meldung",null,null,null,null,null,null,{"$f":"J4","v":"Mai"}]
[null,null,{"$f":"C6","v":"Name:"},{"$f":"D6","v":0},null,null,{"$f":"G6","v":"Vorname:"},{"$f":"H6","v":0},null,null,null,null,{"$f":"M6","v":0}]
[null,null,null,null,null,null,null,null,null,{"$f":"J6","v":"Pers.-Nr.:"},{"$f":"K6","v":0},"Abteilung/Kostenstelle:",null,"Bemerkungen"]
[null,null,{"$f":"C8","v":"Datum"},"Kommen","Gehen","Anwesenh.",{"$f":"G8","v":"Gesamtzeit"},"Mittag","Arbeitszeit",{"$f":"J8","v":"Stunden"},"Bemerkungen"]
[null,null,"Tag","08:00:00","14:35:00","abs. u. TZ","10:00:00","00:35:00","06:00:00",{"$f":"J9","v":"Saldo"},null,"Hinweise",{"$f":"M9","v":"FT/U/GT/SD/K"}]
[{"$f":"A10","v":"Fr"},"0:00","2022-04-30",{"$f":"IF(D10=0,\" \",IF(OR($A52=\"Sa\",$A52=\"So\",$M52=\"FT\"),D10,IF(D10<$D$84,D10,\" \")))","v":" "},{"$f":"IF(E10=0,\" \",IF(OR($A52=\"Sa\",$A52=\"So\",$M52=\"FT\"),E10,IF(E10>$D$85,E10,\" \")))","v":" "},null,{"$f":"IF(G10=0,\" \",IF(G10-H10-O10>$H$85,G10,\" \"))","v":" "},{"$f":"IF(K10=\"->Pause<-\",\"Pause!\",\"\")","v":""},null,null,{"$f":"IF(G52<>\" \",\"AZ > 10 h\",\" \")","v":" "},{"$f":"IF(ISERROR(VLOOKUP(C52,Feiertage,2,FALSE))=TRUE,IF(E52<>\" \",\"Kommen/Gehen vor/nach 06:30/20:00\",IF(D52<>\" \",\"Kommen/Gehen vor/nach 06:30/20:00\",\" \")),VLOOKUP(C52,Feiertage,2,FALSE))","v":"Tag der Arbeit"},{"$f":"IF(Y10>0,Y10,\" \")","v":"FT"},null,null,null,null,null,null,null,null,null,null,null,{"$f":"Y10","v":"FT"}]
["Sa","0:00","2022-05-01"," "," ",null," ",{"$f":"IF(K11=\"->Pause<-\",\"Pause!\",\"\")","v":""},null,null," "," ",{"$f":"IF(Y11>0,Y11,\" \")","v":""},null,null,null,null,null,null,null,null,null,null,null,""]
["So","0:00","2022-05-02"," "," ",null," ","",null,null," "," ","",null,null,null,null,null,null,null,null,null,null,null,""]
["Mo","06:00:00","2022-05-03"," "," ",null," ","",null,null," "," ","",null,null,null,null,null,null,null,null,null,null,null,""]
["Di","06:00:00","2022-05-04"," "," ",null," ","",null,null," "," ","",null,null,null,null,null,null,null,null,null,null,null,""]
["Mi","06:00:00","2022-05-05"," "," ",null," ","",null,null," "," ","",null,null,null,null,null,null,null,null,null,null,null,""]
["Do","06:00:00","2022-05-06"," "," ",null," ","",null,null," "," ","",null,null,null,null,null,null,null,null,null,null,null,""]
["Fr","06:00:00","2022-05-07"," "," ",null," ","",null,null," "," ","",null,null,null,null,null,null,null,null,null,null,null,""]
["Sa","0:00","2022-05-08"," "," ",null," ","",null,null," "," ","",null,null,null,null,null,null,null,null,null,null,null,""]
["So","0:00","2022-05-09"," "," ",null," ","",null,null," "," ","",null,null,null,null,null,null,null,null,null,null,null,""]
["Mo","06:00:00","2022-05-10"," "," ",null," ","",null,null," "," ","",null,null,null,null,null,null,null,null,null,null,null,""]
["Di","06:00:00","2022-05-11"," "," ",null," ","",null,null," "," ","",null,null,null,null,null,null,null,null,null,null,null,""]
["Mi","06:00:00","2022-05-12"," "," ",null," ","",null,null," "," ","",null,null,null,null,null,null,null,null,null,null,null,""]
["Do","0:00","2022-05-13"," "," ",null," ","",null,null," ","Christi Himmelfahrt","FT",null,null,null,null,null,null,null,null,null,null,null,"FT"]
["Fr","06:00:00","2022-05-14"," "," ",null," ","",null,null," "," ","",null,null,null,null,null,null,null,null,null,null,null,""]
["Sa","0:00","2022-05-15"," "," ",null," ","",null,null," "," ","",null,null,null,null,null,null,null,null,null,null,null,""]
["So","0:00","2022-05-16"," "," ",null," ","",null,null," "," ","",null,null,null,null,null,null,null,null,null,null,null,""]
["Mo","06:00:00","2022-05-17"," "," ",null," ","",null,null," "," ","",null,null,null,null,null,null,null,null,null,null,null,""]
["Di","06:00:00","2022-05-18"," "," ",null," ","",null,null," "," ","",null,null,null,null,null,null,null,null,null,null,null,""]
["Mi","06:00:00","2022-05-19"," "," ",null," ","",null,null," "," ","",null,null,null,null,null,null,null,null,null,null,null,""]
["Do","06:00:00","2022-05-20"," "," ",null," ","",null,null," "," ","",null,null,null,null,null,null,null,null,null,null,null,""]
["Fr","06:00:00","2022-05-21"," "," ",null," ","",null,null," "," ","",null,null,null,null,null,null,null,null,null,null,null,""]
["Sa","0:00","2022-05-22"," "," ",null," ","",null,null," "," ","",null,null,null,null,null,null,null,null,null,null,null,""]
["So","0:00","2022-05-23"," "," ",null," ","",null,null," ","Pfingstsonntag ","FT",null,null,null,null,null,null,null,null,null,null,null,"FT"]
["Mo","0:00","2022-05-24",{"$f":"IF(D34=0,\" \",IF(OR($A76=\"Sa\",$A76=\"So\",$M76=\"FT\"),D34,IF(D34<$D$84,D34,\" \")))","v":" "},{"$f":"IF(E34=0,\" \",IF(OR($A76=\"Sa\",$A76=\"So\",$M76=\"FT\"),E34,IF(E34>$D$85,E34,\" \")))","v":" "},null,{"$f":"IF(G34=0,\" \",IF(G34-H34-O34>$H$85,G34,\" \"))","v":" "},"",null,null,{"$f":"IF(G76<>\" \",\"AZ > 10 h\",\" \")","v":" "},"Pfingstmontag ","FT",null,null,null,null,null,null,null,null,null,null,null,"FT"]
["Di","06:00:00","2022-05-25"," "," ",null," ","",null,null," "," ","",null,null,null,null,null,null,null,null,null,null,null,""]
["Mi","06:00:00","2022-05-26"," "," ",null," ","",null,null," "," ","",null,null,null,null,null,null,null,null,null,null,null,""]
["Do","06:00:00","2022-05-27"," "," ",null," ","",null,null," "," ","",null,null,null,null,null,null,null,null,null,null,null,""]
["Fr","06:00:00","2022-05-28"," "," ",null," ","",null,null," "," ","",null,null,null,null,null,null,null,null,null,null,null,""]
["Sa","0:00","2022-05-29"," "," ",null," ","",null,null," "," ","",null,null,null,null,null,null,null,null,null,null,null,""]
["So","0:00","2022-05-30"," "," ",null," ","",null,null," "," ","",null,null,null,null,null,null,null,null,null,null,null,""]
[null,null,"Meldegründe:",null,null,null,null,null,null,null,{"$f":"K41","v":"Mon.saldo"}]
[null,null,"vor","06:30:00",null,null,"Über 60 Stunden",{"$f":"H85*6","v":2.5},"Gesamtsaldo",{"$f":"J42","v":"+ Saldo / Vormonate"},null,null,{"$f":"M42","v":0},{"$f":"N42","v":"Ganztäg. Zeitentnahmen lfd. Monat"}]
[null,null,"nach ","20:00:00",null,null,"Über",{"$f":"G9","v":"10:00:00"},"Std. tägl.","- Auszahlungen",null,{"$f":"L43","v":0},{"$f":"M43","v":0},{"$f":"N43","v":"Ganztäg. Zeitentnahmen Jahr"}]
[{"$f":"Januar!A87","v":"V 2026.1"},null,{"$f":"\"mobile Work / Telearbeit: \"&IF(H4=\"Ja\",'mW-HO'!O37&\"%\",\"n.a.\")","v":"mobile Work / Telearbeit: 0%"},null,null,null,"unter -20 Stunden",{"$f":"-H85*2","v":-0.83333333333333337},"Gesamtsaldo",{"$f":"J44","v":"Gesamtsaldo"},null,{"$f":"IF(H84>L44,\" \",L44)","v":" "}]
[null,null,null,null,null,null,null,null,null,null,null,{"$f":"IF(H86>L44,L44,\" \")","v":" "}]

{"sheet":"Juni","index":6,"n_rows":87,"n_cols":27,"rows_kept":87,"cut":false,"hidden":false,"merged":[[7,19,7,22],[7,15,7,18],[85,2,85,4],[6,11,6,13],[0,0,0,1],[1,0,1,1],[48,3,48,4],[48,7,48,8],[5,7,5,8],[5,3,5,4],[3,5,3,6]]}
[{"$f":"L44","v":-0.19097222222222227},null,"Gesamtsaldo",null,null,null,null,null,null,null,null,null,null,null,null,"Tages-","Mo",{"$f":"INDIRECT(\"'\"&$Y$2&\"'!\"&CELL(\"address\",R1))","v":0.25},null,null,null,null,null,null,"Hilfsspalte","Urlaubstage"]
[{"$f":"L41","v":0},null,"Dieser Monat",null,null,null,null,null,null,null,null,null,null,null,null,"arbeitszeit","Di",0.25,null,null,null,null,null,null,"Mai"]
[null,null,null,null,null,null,null,null,null,null,null,null,null,null,null,null,"Mi",0.25]
[null,null,"Anwesenheitsliste",null,{"$f":"Januar!E4","v":"2021-12-31"},"Report HO/mW Stat.:",null,"Ja","Monat:",{"$f":"VLOOKUP(MONTH(C10),Text_Monatsname,2,FALSE)","v":"Juni"},null,null,"Vertragliche regelmäßige Wochenarbeitszeit: ","\"hh:mm\"",{"$f":"IF(INDIRECT(\"'\"&$Y$2&\"'!\"&CELL(\"address\",O4))=\"\",\"\",INDIRECT(\"'\"&$Y$2&\"'!\"&CELL(\"address\",O4)))","v":1.25},null,"Do",0.25,null,null,null,null,null,null,{"$f":"Y5*Y6","v":1.25}]
[null,null,null,null,null,null,null,null,null,null,null,null,null,"oder: Industrieminuten \"hh,<1/10 h>\"",{"$f":"IF(INDIRECT(\"'\"&$Y$2&\"'!\"&CELL(\"address\",O5))=\"\",\"\",INDIRECT(\"'\"&$Y$2&\"'!\"&CELL(\"address\",O5)))","v":""},"Std/Woche","Fr",0.25,{"$f":"SUM(R1:R7)","v":1.25},null,null,null,null,null,{"$f":"IF(O4<>\"\",IF(O5=\"\",(DAY(O4)*24-24)+HOUR(O4)+MINUTE(O4)/60,IF(O5*Y6=O4,O5,\"Fehler\")),IF(O5<>\"\",O5,\"Fehler\"))","v":30}]
[null,null,"Name:",{"$f":"INDIRECT(\"'\"&$Y$2&\"'!\"&CELL(\"address\",D6))","v":0},null,null,"Vorname:",{"$f":"INDIRECT(\"'\"&$Y$2&\"'!\"&CELL(\"address\",H6))","v":0},null,"Pers.-Nr.:",{"$f":"INDIRECT(\"'\"&$Y$2&\"'!\"&CELL(\"address\",K6))","v":0},"Abteilung/Kostenstelle:",{"$f":"INDIRECT(\"'\"&$Y$2&\"'!\"&CELL(\"address\",M6))","v":0},null,{"$f":"IF(Y5=\"Fehler\",\"nur ein Wert!\",\"\")","v":""},"Mittagspause","Sa",0,{"$f":"IF(Y4=S5,\"Saldo O.K.\",\"Saldo falsch\")","v":"Saldo O.K."},null,null,null,null,null,"01:00:00"]
[null,null,null,null,null,null,null,null,null,null,null,"Mittagspause (Ja / Nein)  ",null,null,{"$f":"INDIRECT(\"'\"&$Y$2&\"'!\"&CELL(\"address\",O7))","v":"Ja"},{"$f":"INDIRECT(\"'\"&$Y$2&\"'!\"&CELL(\"address\",P7))","v":"00:35:00"},"So",0]
[null,"Soll","Datum","Kommen","Gehen","Anwesenh.","Gesamtzeit","Mittag","Arbeitszeit","Stunden","Bemerkungen",null,"Dienstl./Sonstige Abwesenheit",null,null,"Dokumentation sonstige Abwesenheit",null,null,null,"zusätzliche Reisezeit"]
[null,"Std","Tag","08:00:00",{"$f":"D9+I9+H9","v":"14:35:00"},"abs. u. TZ","10:00:00",{"$f":"IF(O7=\"NEIN\",0,P7)","v":"00:35:00"},{"$f":"Y4/5","v":"06:00:00"},"Saldo",null,"Hinweise","FT/U/GT/SD/K","SAR","Korrektur","von","bis","von","bis","von","bis","von","bis",null,null,{"$f":"VLOOKUP(J4,Werte_UrlaubstageProMonat,2,FALSE)","v":0}]
[{"$f":"VLOOKUP(WEEKDAY(C10,2),Text_Wochentag,2)","v":"Mo"},{"$f":"IF(OR(A10=\"Sa\",A10=\"So\"),\"0:00\",IF(Y10=\"FT\",\"0:00\",$I$9))","v":"06:00:00"},{"$f":"Mai!C40+1","v":"2022-05-31"},"00:00:00","00:00:00",null,{"$f":"IF(I10=\" \",0,I10 + IF(N10=\"Ja\", (U10-T10) + (W10-V10),0))","v":"00:00:00"},{"$f":"$H$9","v":"00:35:00"},{"$f":"IFERROR(IF(E10=0,IF(D10=0,\" \",E10-D10+F10-H10),TIME(HOUR(E10-D10+F10),MINUTE(E10-D10+F10),0)-H10) - IF(N10=\"Ja\",(Q10-P10) + (S10-R10),0),\" \")","v":" "},{"$f":"IF(Y10=\"GT\",-B10,IF(E10>0,G10-B10,IF(F10>0,G10-B10,\"     ---   \")))","v":"     ---   "},{"$f":"IF(G10<0,$I$9+D10+H10+O10, IFERROR(IF(OR(AND((I10*24)>9,((H10+IF(N10=\"Ja\",(Q10-P10)+(S10-R10),0))*24*60)<45),AND((I10*24)>6,((H10+IF(N10=\"Ja\",(Q10-P10)+(S10-R10),0))*24*60)<30)),\"->Pause<-\",\"\"),\"\"))","v":""},{"$f":"IF(ISERROR(VLOOKUP(C10,Feiertage,2,FALSE))=TRUE,IF(G10<0,\"Uhr  mind. Arbeitszeit\",IF(AND(I10<>\" \",I10>$G$9),\"Arbeitszeit >10 Std.\",\" \")),VLOOKUP(C10,Feiertage,2,FALSE))","v":" "},{"$f":"IF(ISERROR(VLOOKUP(C10,Feiertage,2,FALSE))=TRUE,\"\",\"FT\")","v":""},null,{"$f":"IF(N10=\"Ja\",((U10-T10)+(W10-V10))-((Q10-P10)+(S10-R10)),0)","v":0},null,null,null,null,null,null,null,null,null,{"$f":"UPPER(TRIM(M10))","v":""},{"$f":"IF(AA10=\"\",\"\",MAX(Z$9:Z9)+1)","v":""},{"$f":"IF(M10=\"U\",C10,\"\")","v":""}]
["Di",{"$f":"IF(OR(A11=\"Sa\",A11=\"So\"),\"0:00\",IF(Y11=\"FT\",\"0:00\",$I$9))","v":"06:00:00"},{"$f":"C10+1","v":"2022-06-01"},"00:00:00","00:00:00",null,"00:00:00","00:35:00",{"$f":"IFERROR(IF(E11=0,IF(D11=0,\" \",E11-D11+F11-H11),TIME(HOUR(E11-D11+F11),MINUTE(E11-D11+F11),0)-H11) - IF(N11=\"Ja\",(Q11-P11) + (S11-R11),0),\" \")","v":" "},{"$f":"IF(Y11=\"GT\",-B11,IF(E11>0,G11-B11,IF(F11>0,G11-B11,\"     ---   \")))","v":"     ---   "},{"$f":"IF(G11<0,$I$9+D11+H11+O11, IFERROR(IF(OR(AND((I11*24)>9,((H11+O11)*24*60)<45),AND((I11*24)>6,((H11+O11)*24*60)<30)),\"->Pause<-\",\"\"),\"\"))","v":""}," ","",null,{"$f":"IF(N11=\"Ja\",((U11-T11)+(W11-V11))-((Q11-P11)+(S11-R11)),0)","v":0},null,null,null,null,null,null,null,null,null,"",{"$f":"IF(AA11=\"\",\"\",MAX(Z$9:Z10)+1)","v":""},{"$f":"IF(M11=\"U\",C11,\"\")","v":""}]
["Mi","06:00:00","2022-06-02","00:00:00","00:00:00",null,"00:00:00","00:35:00"," ","     ---   ",""," ","",null,0,null,null,null,null,null,null,null,null,null,"",{"$f":"IF(AA12=\"\",\"\",MAX(Z$9:Z11)+1)","v":""},""]
["Do","0:00","2022-06-03","00:00:00","00:00:00",null,"00:00:00","00:35:00"," ","     ---   ","","Fronleichnam ","FT",null,0,null,null,null,null,null,null,null,null,null,"FT",{"$f":"IF(AA13=\"\",\"\",MAX(Z$9:Z12)+1)","v":""},""]
["Fr","06:00:00","2022-06-04","00:00:00","00:00:00",null,"00:00:00","00:35:00"," ","     ---   ",""," ","",null,0,null,null,null,null,null,null,null,null,null,"",{"$f":"IF(AA14=\"\",\"\",MAX(Z$9:Z13)+1)","v":""},""]
["Sa","0:00","2022-06-05","00:00:00","00:00:00",null,"00:00:00","00:35:00"," ","     ---   ",""," ","",null,0,null,null,null,null,null,null,null,null,null,"",{"$f":"IF(AA15=\"\",\"\",MAX(Z$9:Z14)+1)","v":""},""]
["So","0:00","2022-06-06","00:00:00","00:00:00",null,"00:00:00","00:35:00"," ","     ---   ",""," ","",null,0,null,null,null,null,null,null,null,null,null,"",{"$f":"IF(AA16=\"\",\"\",MAX(Z$9:Z15)+1)","v":""},""]
["Mo","06:00:00","2022-06-07","00:00:00","00:00:00",null,"00:00:00","00:35:00"," ","     ---   ",""," ","",null,0,null,null,null,null,null,null,null,null,null,"",{"$f":"IF(AA17=\"\",\"\",MAX(Z$9:Z16)+1)","v":""},""]
["Di","06:00:00","2022-06-08","00:00:00","00:00:00",null,"00:00:00","00:35:00"," ","     ---   ",""," ","",null,0,null,null,null,null,null,null,null,null,null,"",{"$f":"IF(AA18=\"\",\"\",MAX(Z$9:Z17)+1)","v":""},""]
["Mi","06:00:00","2022-06-09","00:00:00","00:00:00",null,"00:00:00","00:35:00"," ","     ---   ",""," ","",null,0,null,null,null,null,null,null,null,null,null,"",{"$f":"IF(AA19=\"\",\"\",MAX(Z$9:Z18)+1)","v":""},""]
["Do","06:00:00","2022-06-10","00:00:00","00:00:00",null,"00:00:00","00:35:00"," ","     ---   ",""," ","",null,0,null,null,null,null,null,null,null,null,null,"",{"$f":"IF(AA20=\"\",\"\",MAX(Z$9:Z19)+1)","v":""},""]
["Fr","06:00:00","2022-06-11","00:00:00","00:00:00",null,"00:00:00","00:35:00"," ","     ---   ",""," ","",null,0,null,null,null,null,null,null,null,null,null,"",{"$f":"IF(AA21=\"\",\"\",MAX(Z$9:Z20)+1)","v":""},""]
["Sa","0:00","2022-06-12","00:00:00","00:00:00",null,"00:00:00","00:35:00"," ","     ---   ",""," ","",null,0,null,null,null,null,null,null,null,null,null,"",{"$f":"IF(AA22=\"\",\"\",MAX(Z$9:Z21)+1)","v":""},""]
["So","0:00","2022-06-13","00:00:00","00:00:00",null,"00:00:00","00:35:00"," ","     ---   ",""," ","",null,0,null,null,null,null,null,null,null,null,null,"",{"$f":"IF(AA23=\"\",\"\",MAX(Z$9:Z22)+1)","v":""},""]
["Mo","06:00:00","2022-06-14","00:00:00","00:00:00",null,"00:00:00","00:35:00"," ","     ---   ",""," ","",null,0,null,null,null,null,null,null,null,null,null,"",{"$f":"IF(AA24=\"\",\"\",MAX(Z$9:Z23)+1)","v":""},""]
["Di","06:00:00","2022-06-15","00:00:00","00:00:00",null,"00:00:00","00:35:00"," ","     ---   ",""," ","",null,0,null,null,null,null,null,null,null,null,null,"",{"$f":"IF(AA25=\"\",\"\",MAX(Z$9:Z24)+1)","v":""},""]
["Mi","06:00:00","2022-06-16","00:00:00","00:00:00",null,"00:00:00","00:35:00"," ","     ---   ",""," ","",null,0,null,null,null,null,null,null,null,null,null,"",{"$f":"IF(AA26=\"\",\"\",MAX(Z$9:Z25)+1)","v":""},""]
["Do","06:00:00","2022-06-17","00:00:00","00:00:00",null,"00:00:00","00:35:00"," ","     ---   ",""," ","",null,0,null,null,null,null,null,null,null,null,null,"",{"$f":"IF(AA27=\"\",\"\",MAX(Z$9:Z26)+1)","v":""},""]
["Fr","06:00:00","2022-06-18","00:00:00","00:00:00",null,"00:00:00","00:35:00"," ","     ---   ",""," ","",null,0,null,null,null,null,null,null,null,null,null,"",{"$f":"IF(AA28=\"\",\"\",MAX(Z$9:Z27)+1)","v":""},""]
["Sa","0:00","2022-06-19","00:00:00","00:00:00",null,"00:00:00","00:35:00"," ","     ---   ",""," ","",null,0,null,null,null,null,null,null,null,null,null,"",{"$f":"IF(AA29=\"\",\"\",MAX(Z$9:Z28)+1)","v":""},""]
["So","0:00","2022-06-20","00:00:00","00:00:00",null,"00:00:00","00:35:00"," ","     ---   ",""," ","",null,0,null,null,null,null,null,null,null,null,null,"",{"$f":"IF(AA30=\"\",\"\",MAX(Z$9:Z29)+1)","v":""},""]
["Mo","06:00:00","2022-06-21","00:00:00","00:00:00",null,"00:00:00","00:35:00"," ","     ---   ",""," ","",null,0,null,null,null,null,null,null,null,null,null,"",{"$f":"IF(AA31=\"\",\"\",MAX(Z$9:Z30)+1)","v":""},""]
["Di","06:00:00","2022-06-22","00:00:00","00:00:00",null,"00:00:00","00:35:00"," ","     ---   ",""," ","",null,0,null,null,null,null,null,null,null,null,null,"",{"$f":"IF(AA32=\"\",\"\",MAX(Z$9:Z31)+1)","v":""},""]
["Mi","06:00:00","2022-06-23","00:00:00","00:00:00",null,"00:00:00","00:35:00"," ","     ---   ",""," ","",null,0,null,null,null,null,null,null,null,null,null,"",{"$f":"IF(AA33=\"\",\"\",MAX(Z$9:Z32)+1)","v":""},""]
["Do","06:00:00","2022-06-24","00:00:00","00:00:00",null,"00:00:00","00:35:00"," ","     ---   ",""," ","",null,0,null,null,null,null,null,null,null,null,null,"",{"$f":"IF(AA34=\"\",\"\",MAX(Z$9:Z33)+1)","v":""},""]
["Fr","06:00:00","2022-06-25","00:00:00","00:00:00",null,"00:00:00","00:35:00"," ","     ---   ",""," ","",null,0,null,null,null,null,null,null,null,null,null,"",{"$f":"IF(AA35=\"\",\"\",MAX(Z$9:Z34)+1)","v":""},""]
["Sa","0:00","2022-06-26","00:00:00","00:00:00",null,"00:00:00","00:35:00"," ","     ---   ",""," ","",null,0,null,null,null,null,null,null,null,null,null,"",{"$f":"IF(AA36=\"\",\"\",MAX(Z$9:Z35)+1)","v":""},""]
["So","0:00","2022-06-27","00:00:00","00:00:00",null,"00:00:00","00:35:00"," ","     ---   ",""," ","",null,0,null,null,null,null,null,null,null,null,null,"",{"$f":"IF(AA37=\"\",\"\",MAX(Z$9:Z36)+1)","v":""},""]
["Mo","06:00:00","2022-06-28","00:00:00","00:00:00",null,"00:00:00","00:35:00"," ","     ---   ",""," ","",null,0,null,null,null,null,null,null,null,null,null,"",{"$f":"IF(AA38=\"\",\"\",MAX(Z$9:Z37)+1)","v":""},""]
["Di","06:00:00","2022-06-29","00:00:00","00:00:00",null,"00:00:00","00:35:00"," ","     ---   ",""," ","",null,0,null,null,null,null,null,null,null,null,null,"",{"$f":"IF(AA39=\"\",\"\",MAX(Z$9:Z38)+1)","v":""},""]
[null,null,null,null,null,null,null,null,null,"     ---   ",null,null,null,null,0]
[null,null,null,null,null,null,null,null,null,{"$f":"SUM(J10:J39)","v":0},"Mon.saldo",{"$f":"J41","v":0},null,null,null,null,null,null,null,null,null,null,null,null,null,{"$f":"IF(AA41=\"\",\"\",MAX(Z$9:Z39)+1)","v":""},""]
[null,null,null,null,null,null,null,null,null,"+ Saldo / Vormonate",null,{"$f":"Mai!L44","v":-0.19097222222222227},{"$f":"VLOOKUP($J$4,Tabelle_Kürzel_Abwesenheit,Spalte_GT_Monat,FALSE)","v":0},"Ganztäg. Zeitentnahmen lfd. Monat",null,{"$f":"VLOOKUP($J$4,Tabelle_Kürzel_Abwesenheit,Spalte_U_Monat,FALSE)","v":0},"Urlaub lfd. Monat",{"$f":"VLOOKUP($J$4,Tabelle_Kürzel_Abwesenheit,Spalte_K_Monat,FALSE)","v":0},"krank lfd. Monat",null,null,null,null,null,null,{"$f":"MAX(Z9:Z41)","v":0},{"$f":"COUNT(AA10:AA41)","v":0}]
[null,null,null,null,null,null,null,null,null,"- Auszahlungen",null,0,{"$f":"VLOOKUP($J$4,Tabelle_Kürzel_Abwesenheit,Spalte_GT_Summe,FALSE)","v":0},"Ganztäg. Zeitentnahmen Jahr",null,{"$f":"VLOOKUP($J$4,Tabelle_Kürzel_Abwesenheit,Spalte_U_Summe,FALSE)","v":0},"Urlaub Jahr",{"$f":"VLOOKUP($J$4,Tabelle_Kürzel_Abwesenheit,Spalte_K_Summe,FALSE)","v":0},"krank Jahr"]
[null,null,null,null,null,null,null,null,null,"Gesamtsaldo",null,{"$f":"SUM(L41:L42)-L43","v":-0.19097222222222227}]
[]
[]
[null,null,"Vorgesetzten-",null,{"$f":"E4","v":"2021-12-31"},null,null,null,{"$f":"I4","v":"Monat:"},null,null,null,null,{"$f":"M4","v":"Vertragliche regelmäßige Wochenarbeitszeit: "},{"$f":"Y5","v":30},{"$f":"P5","v":"Std/Woche"}]
[null,null,"Meldung",null,null,null,null,null,null,{"$f":"J4","v":"Juni"}]
[null,null,{"$f":"C6","v":"Name:"},{"$f":"D6","v":0},null,null,{"$f":"G6","v":"Vorname:"},{"$f":"H6","v":0},null,null,null,null,{"$f":"M6","v":0}]
[null,null,null,null,null,null,null,null,null,{"$f":"J6","v":"Pers.-Nr.:"},{"$f":"K6","v":0},"Abteilung/Kostenstelle:",null,"Bemerkungen"]
[null,null,{"$f":"C8","v":"Datum"},"Kommen","Gehen","Anwesenh.",{"$f":"G8","v":"Gesamtzeit"},"Mittag","Arbeitszeit",{"$f":"J8","v":"Stunden"},"Bemerkungen"]
[null,null,"Tag","08:00:00","14:35:00","abs. u. TZ","10:00:00","00:35:00","06:00:00",{"$f":"J9","v":"Saldo"},null,"Hinweise",{"$f":"M9","v":"FT/U/GT/SD/K"}]
[{"$f":"A10","v":"Mo"},"06:00:00","2022-05-31",{"$f":"IF(D10=0,\" \",IF(OR($A53=\"Sa\",$A53=\"So\",$M53=\"FT\"),D10,IF(D10<$D$84,D10,\" \")))","v":" "},{"$f":"IF(E10=0,\" \",IF(OR($A53=\"Sa\",$A53=\"So\",$M53=\"FT\"),E10,IF(E10>$D$85,E10,\" \")))","v":" "},null,{"$f":"IF(G10=0,\" \",IF(G10-H10-O10>$H$85,G10,\" \"))","v":" "},{"$f":"IF(K10=\"->Pause<-\",\"Pause!\",\"\")","v":""},null,null,{"$f":"IF(G53<>\" \",\"AZ > 10 h\",\" \")","v":" "},{"$f":"IF(ISERROR(VLOOKUP(C53,Feiertage,2,FALSE))=TRUE,IF(E53<>\" \",\"Kommen/Gehen vor/nach 06:30/20:00\",IF(D53<>\" \",\"Kommen/Gehen vor/nach 06:30/20:00\",\" \")),VLOOKUP(C53,Feiertage,2,FALSE))","v":" "},{"$f":"IF(Y10>0,Y10,\" \")","v":""},null,null,null,null,null,null,null,null,null,null,null,{"$f":"Y10","v":""}]
["Di","06:00:00","2022-06-01"," "," ",null," ",{"$f":"IF(K11=\"->Pause<-\",\"Pause!\",\"\")","v":""},null,null," "," ",{"$f":"IF(Y11>0,Y11,\" \")","v":""},null,null,null,null,null,null,null,null,null,null,null,""]
["Mi","06:00:00","2022-06-02"," "," ",null," ","",null,null," "," ","",null,null,null,null,null,null,null,null,null,null,null,""]
["Do","0:00","2022-06-03"," "," ",null," ","",null,null," ","Fronleichnam ","FT",null,null,null,null,null,null,null,null,null,null,null,"FT"]
["Fr","06:00:00","2022-06-04"," "," ",null," ","",null,null," "," ","",null,null,null,null,null,null,null,null,null,null,null,""]
["Sa","0:00","2022-06-05"," "," ",null," ","",null,null," "," ","",null,null,null,null,null,null,null,null,null,null,null,""]
["So","0:00","2022-06-06"," "," ",null," ","",null,null," "," ","",null,null,null,null,null,null,null,null,null,null,null,""]
["Mo","06:00:00","2022-06-07"," "," ",null," ","",null,null," "," ","",null,null,null,null,null,null,null,null,null,null,null,""]
["Di","06:00:00","2022-06-08"," "," ",null," ","",null,null," "," ","",null,null,null,null,null,null,null,null,null,null,null,""]
["Mi","06:00:00","2022-06-09"," "," ",null," ","",null,null," "," ","",null,null,null,null,null,null,null,null,null,null,null,""]
["Do","06:00:00","2022-06-10"," "," ",null," ","",null,null," "," ","",null,null,null,null,null,null,null,null,null,null,null,""]
["Fr","06:00:00","2022-06-11"," "," ",null," ","",null,null," "," ","",null,null,null,null,null,null,null,null,null,null,null,""]
["Sa","0:00","2022-06-12"," "," ",null," ","",null,null," "," ","",null,null,null,null,null,null,null,null,null,null,null,""]
["So","0:00","2022-06-13"," "," ",null," ","",null,null," "," ","",null,null,null,null,null,null,null,null,null,null,null,""]
["Mo","06:00:00","2022-06-14"," "," ",null," ","",null,null," "," ","",null,null,null,null,null,null,null,null,null,null,null,""]
["Di","06:00:00","2022-06-15"," "," ",null," ","",null,null," "," ","",null,null,null,null,null,null,null,null,null,null,null,""]
["Mi","06:00:00","2022-06-16"," "," ",null," ","",null,null," "," ","",null,null,null,null,null,null,null,null,null,null,null,""]
["Do","06:00:00","2022-06-17"," "," ",null," ","",null,null," "," ","",null,null,null,null,null,null,null,null,null,null,null,""]
["Fr","06:00:00","2022-06-18"," "," ",null," ","",null,null," "," ","",null,null,null,null,null,null,null,null,null,null,null,""]
["Sa","0:00","2022-06-19"," "," ",null," ","",null,null," "," ","",null,null,null,null,null,null,null,null,null,null,null,""]
["So","0:00","2022-06-20"," "," ",null," ","",null,null," "," ","",null,null,null,null,null,null,null,null,null,null,null,""]
["Mo","06:00:00","2022-06-21"," "," ",null," ","",null,null," "," ","",null,null,null,null,null,null,null,null,null,null,null,""]
["Di","06:00:00","2022-06-22"," "," ",null," ","",null,null," "," ","",null,null,null,null,null,null,null,null,null,null,null,""]
["Mi","06:00:00","2022-06-23"," "," ",null," ","",null,null," "," ","",null,null,null,null,null,null,null,null,null,null,null,""]
["Do","06:00:00","2022-06-24"," "," ",null," ","",null,null," "," ","",null,null,null,null,null,null,null,null,null,null,null,""]
["Fr","06:00:00","2022-06-25"," "," ",null," ","",null,null," "," ","",null,null,null,null,null,null,null,null,null,null,null,""]
["Sa","0:00","2022-06-26"," "," ",null," ","",null,null," "," ","",null,null,null,null,null,null,null,null,null,null,null,""]
["So","0:00","2022-06-27"," "," ",null," ","",null,null," "," ","",null,null,null,null,null,null,null,null,null,null,null,""]
["Mo","06:00:00","2022-06-28"," "," ",null," ","",null,null," "," ","",null,null,null,null,null,null,null,null,null,null,null,""]
["Di","06:00:00","2022-06-29"," "," ",null," ","",null,null," "," ","",null,null,null,null,null,null,null,null,null,null,null,""]
[null,null,"Meldegründe:",null,null,null,null,null,null,null,{"$f":"K41","v":"Mon.saldo"}]
[null,null,"vor","06:30:00",null,null,"Über 60 Stunden",{"$f":"H85*6","v":2.5},"Gesamtsaldo",{"$f":"J42","v":"+ Saldo / Vormonate"},null,null,{"$f":"M42","v":0},{"$f":"N42","v":"Ganztäg. Zeitentnahmen lfd. Monat"}]
[null,null,"nach ","20:00:00",null,null,"Über",{"$f":"G9","v":"10:00:00"},"Std. tägl.","- Auszahlungen",null,null,{"$f":"M43","v":0},{"$f":"N43","v":"Ganztäg. Zeitentnahmen Jahr"}]
[{"$f":"Januar!A87","v":"V 2026.1"},null,{"$f":"\"mobile Work / Telearbeit: \"&IF(H4=\"Ja\",'mW-HO'!R37&\"%\",\"n.a.\")","v":"mobile Work / Telearbeit: 0%"},null,null,null,"unter -20 Stunden",{"$f":"-H85*2","v":-0.83333333333333337},"Gesamtsaldo",{"$f":"J44","v":"Gesamtsaldo"},null,{"$f":"IF(H84>L44,\" \",L44)","v":" "}]
[null,null,null,null,null,null,null,null,null,null,null,{"$f":"IF(H86>L44,L44,\" \")","v":" "}]

{"sheet":"Juli","index":7,"n_rows":87,"n_cols":27,"rows_kept":87,"cut":false,"hidden":false,"merged":[[7,19,7,22],[7,15,7,18],[85,2,85,4],[6,11,6,13],[0,0,0,1],[1,0,1,1],[47,3,47,4],[47,7,47,8],[5,7,5,8],[5,3,5,4],[3,5,3,6]]}
[{"$f":"L44","v":-0.19097222222222227},null,"Gesamtsaldo",null,null,null,null,null,null,null,null,null,null,null,null,"Tages-","Mo",{"$f":"INDIRECT(\"'\"&$Y$2&\"'!\"&CELL(\"address\",R1))","v":0.25},null,null,null,null,null,null,"Hilfsspalte","Urlaubstage"]
[{"$f":"L41","v":0},null,"Dieser Monat",null,null,null,null,null,null,null,null,null,null,null,null,"arbeitszeit","Di",0.25,null,null,null,null,null,null,"Juni"]
[null,null,null,null,null,null,null,null,null,null,null,null,null,null,null,null,"Mi",0.25]
[null,null,"Anwesenheitsliste",null,{"$f":"Januar!E4","v":"2021-12-31"},"Report HO/mW Stat.:",null,"Ja","Monat:",{"$f":"VLOOKUP(MONTH(C10),Text_Monatsname,2,FALSE)","v":"Juli"},null,null,"Vertragliche regelmäßige Wochenarbeitszeit: ","\"hh:mm\"",{"$f":"IF(INDIRECT(\"'\"&$Y$2&\"'!\"&CELL(\"address\",O4))=\"\",\"\",INDIRECT(\"'\"&$Y$2&\"'!\"&CELL(\"address\",O4)))","v":1.25},null,"Do",0.25,null,null,null,null,null,null,{"$f":"Y5*Y6","v":1.25}]
[null,null,null,null,null,null,null,null,null,null,null,null,null,"oder: Industrieminuten \"hh,<1/10 h>\"",{"$f":"IF(INDIRECT(\"'\"&$Y$2&\"'!\"&CELL(\"address\",O5))=\"\",\"\",INDIRECT(\"'\"&$Y$2&\"'!\"&CELL(\"address\",O5)))","v":""},"Std/Woche","Fr",0.25,{"$f":"SUM(R1:R7)","v":1.25},null,null,null,null,null,{"$f":"IF(O4<>\"\",IF(O5=\"\",(DAY(O4)*24-24)+HOUR(O4)+MINUTE(O4)/60,IF(O5*Y6=O4,O5,\"Fehler\")),IF(O5<>\"\",O5,\"Fehler\"))","v":30}]
[null,null,"Name:",{"$f":"INDIRECT(\"'\"&$Y$2&\"'!\"&CELL(\"address\",D6))","v":0},null,null,"Vorname:",{"$f":"INDIRECT(\"'\"&$Y$2&\"'!\"&CELL(\"address\",H6))","v":0},null,"Pers.-Nr.:",{"$f":"INDIRECT(\"'\"&$Y$2&\"'!\"&CELL(\"address\",K6))","v":0},"Abteilung/Kostenstelle:",{"$f":"INDIRECT(\"'\"&$Y$2&\"'!\"&CELL(\"address\",M6))","v":0},null,{"$f":"IF(Y5=\"Fehler\",\"nur ein Wert!\",\"\")","v":""},"Mittagspause","Sa",0,{"$f":"IF(Y4=S5,\"Saldo O.K.\",\"Saldo falsch\")","v":"Saldo O.K."},null,null,null,null,null,"01:00:00"]
[null,null,null,null,null,null,null,null,null,null,null,"Mittagspause (Ja / Nein)  ",null,null,{"$f":"INDIRECT(\"'\"&$Y$2&\"'!\"&CELL(\"address\",O7))","v":"Ja"},{"$f":"INDIRECT(\"'\"&$Y$2&\"'!\"&CELL(\"address\",P7))","v":"00:35:00"},"So",0]
[null,"Soll","Datum","Kommen","Gehen","Anwesenh.","Gesamtzeit","Mittag","Arbeitszeit","Stunden","Bemerkungen",null,"Dienstl./Sonstige Abwesenheit",null,null,"Dokumentation sonstige Abwesenheit",null,null,null,"zusätzliche Reisezeit"]
[null,"Std","Tag","08:00:00",{"$f":"D9+I9+H9","v":"14:35:00"},"abs. u. TZ","10:00:00",{"$f":"IF(O7=\"NEIN\",0,P7)","v":"00:35:00"},{"$f":"Y4/5","v":"06:00:00"},"Saldo",null,"Hinweise","FT/U/GT/SD/K","SAR","Korrektur","von","bis","von","bis","von","bis","von","bis",null,null,{"$f":"VLOOKUP(J4,Werte_UrlaubstageProMonat,2,FALSE)","v":0}]
[{"$f":"VLOOKUP(WEEKDAY(C10,2),Text_Wochentag,2)","v":"Mi"},{"$f":"IF(OR(A10=\"Sa\",A10=\"So\"),\"0:00\",IF(Y10=\"FT\",\"0:00\",$I$9))","v":"06:00:00"},{"$f":"Juni!C39+1","v":"2022-06-30"},"00:00:00","00:00:00",null,{"$f":"IF(I10=\" \",0,I10 + IF(N10=\"Ja\", (U10-T10) + (W10-V10),0))","v":"00:00:00"},{"$f":"$H$9","v":"00:35:00"},{"$f":"IFERROR(IF(E10=0,IF(D10=0,\" \",E10-D10+F10-H10),TIME(HOUR(E10-D10+F10),MINUTE(E10-D10+F10),0)-H10) - IF(N10=\"Ja\",(Q10-P10) + (S10-R10),0),\" \")","v":" "},{"$f":"IF(Y10=\"GT\",-B10,IF(E10>0,G10-B10,IF(F10>0,G10-B10,\"     ---   \")))","v":"     ---   "},{"$f":"IF(G10<0,$I$9+D10+H10+O10, IFERROR(IF(OR(AND((I10*24)>9,((H10+IF(N10=\"Ja\",(Q10-P10)+(S10-R10),0))*24*60)<45),AND((I10*24)>6,((H10+IF(N10=\"Ja\",(Q10-P10)+(S10-R10),0))*24*60)<30)),\"->Pause<-\",\"\"),\"\"))","v":""},{"$f":"IF(ISERROR(VLOOKUP(C10,Feiertage,2,FALSE))=TRUE,IF(G10<0,\"Uhr  mind. Arbeitszeit\",IF(AND(I10<>\" \",I10>$G$9),\"Arbeitszeit >10 Std.\",\" \")),VLOOKUP(C10,Feiertage,2,FALSE))","v":" "},{"$f":"IF(ISERROR(VLOOKUP(C10,Feiertage,2,FALSE))=TRUE,\"\",\"FT\")","v":""},null,{"$f":"IF(N10=\"Ja\",((U10-T10)+(W10-V10))-((Q10-P10)+(S10-R10)),0)","v":0},null,null,null,null,null,null,null,null,null,{"$f":"UPPER(TRIM(M10))","v":""},{"$f":"IF(AA10=\"\",\"\",MAX(Z$9:Z9)+1)","v":""},{"$f":"IF(M10=\"U\",C10,\"\")","v":""}]
["Do",{"$f":"IF(OR(A11=\"Sa\",A11=\"So\"),\"0:00\",IF(Y11=\"FT\",\"0:00\",$I$9))","v":"06:00:00"},{"$f":"C10+1","v":"2022-07-01"},"00:00:00","00:00:00",null,{"$f":"IF(I11=\" \",0,I11 + IF(N11=\"Ja\", (U11-T11) + (W11-V11),0))","v":"00:00:00"},"00:35:00",{"$f":"IFERROR(IF(E11=0,IF(D11=0,\" \",E11-D11+F11-H11),TIME(HOUR(E11-D11+F11),MINUTE(E11-D11+F11),0)-H11) - IF(N11=\"Ja\",(Q11-P11) + (S11-R11),0),\" \")","v":" "},{"$f":"IF(Y11=\"GT\",-B11,IF(E11>0,G11-B11,IF(F11>0,G11-B11,\"     ---   \")))","v":"     ---   "},{"$f":"IF(G11<0,$I$9+D11+H11+O11, IFERROR(IF(OR(AND((I11*24)>9,((H11+IF(N11=\"Ja\",(Q11-P11)+(S11-R11),0))*24*60)<45),AND((I11*24)>6,((H11+IF(N11=\"Ja\",(Q11-P11)+(S11-R11),0))*24*60)<30)),\"->Pause<-\",\"\"),\"\"))","v":""}," ","",null,{"$f":"IF(N11=\"Ja\",((U11-T11)+(W11-V11))-((Q11-P11)+(S11-R11)),0)","v":0},null,null,null,null,null,null,null,null,null,"",{"$f":"IF(AA11=\"\",\"\",MAX(Z$9:Z10)+1)","v":""},{"$f":"IF(M11=\"U\",C11,\"\")","v":""}]
["Fr","06:00:00","2022-07-02","00:00:00","00:00:00",null,"00:00:00","00:35:00"," ","     ---   ",""," ","",null,0,null,null,null,null,null,null,null,null,null,"",{"$f":"IF(AA12=\"\",\"\",MAX(Z$9:Z11)+1)","v":""},""]
["Sa","0:00","2022-07-03","00:00:00","00:00:00",null,"00:00:00","00:35:00"," ","     ---   ",""," ","",null,0,null,null,null,null,null,null,null,null,null,"",{"$f":"IF(AA13=\"\",\"\",MAX(Z$9:Z12)+1)","v":""},""]
["So","0:00","2022-07-04","00:00:00","00:00:00",null,"00:00:00","00:35:00"," ","     ---   ",""," ","",null,0,null,null,null,null,null,null,null,null,null,"",{"$f":"IF(AA14=\"\",\"\",MAX(Z$9:Z13)+1)","v":""},""]
["Mo","06:00:00","2022-07-05","00:00:00","00:00:00",null,"00:00:00","00:35:00"," ","     ---   ",""," ","",null,0,null,null,null,null,null,null,null,null,null,"",{"$f":"IF(AA15=\"\",\"\",MAX(Z$9:Z14)+1)","v":""},""]
["Di","06:00:00","2022-07-06","00:00:00","00:00:00",null,"00:00:00","00:35:00"," ","     ---   ",""," ","",null,0,null,null,null,null,null,null,null,null,null,"",{"$f":"IF(AA16=\"\",\"\",MAX(Z$9:Z15)+1)","v":""},""]
["Mi","06:00:00","2022-07-07","00:00:00","00:00:00",null,"00:00:00","00:35:00"," ","     ---   ",""," ","",null,0,null,null,null,null,null,null,null,null,null,"",{"$f":"IF(AA17=\"\",\"\",MAX(Z$9:Z16)+1)","v":""},""]
["Do","06:00:00","2022-07-08","00:00:00","00:00:00",null,"00:00:00","00:35:00"," ","     ---   ",""," ","",null,0,null,null,null,null,null,null,null,null,null,"",{"$f":"IF(AA18=\"\",\"\",MAX(Z$9:Z17)+1)","v":""},""]
["Fr","06:00:00","2022-07-09","00:00:00","00:00:00",null,"00:00:00","00:35:00"," ","     ---   ",""," ","",null,0,null,null,null,null,null,null,null,null,null,"",{"$f":"IF(AA19=\"\",\"\",MAX(Z$9:Z18)+1)","v":""},""]
["Sa","0:00","2022-07-10","00:00:00","00:00:00",null,"00:00:00","00:35:00"," ","     ---   ",""," ","",null,0,null,null,null,null,null,null,null,null,null,"",{"$f":"IF(AA20=\"\",\"\",MAX(Z$9:Z19)+1)","v":""},""]
["So","0:00","2022-07-11","00:00:00","00:00:00",null,"00:00:00","00:35:00"," ","     ---   ",""," ","",null,0,null,null,null,null,null,null,null,null,null,"",{"$f":"IF(AA21=\"\",\"\",MAX(Z$9:Z20)+1)","v":""},""]
["Mo","06:00:00","2022-07-12","00:00:00","00:00:00",null,"00:00:00","00:35:00"," ","     ---   ",""," ","",null,0,null,null,null,null,null,null,null,null,null,"",{"$f":"IF(AA22=\"\",\"\",MAX(Z$9:Z21)+1)","v":""},""]
["Di","06:00:00","2022-07-13","00:00:00","00:00:00",null,"00:00:00","00:35:00"," ","     ---   ",""," ","",null,0,null,null,null,null,null,null,null,null,null,"",{"$f":"IF(AA23=\"\",\"\",MAX(Z$9:Z22)+1)","v":""},""]
["Mi","06:00:00","2022-07-14","00:00:00","00:00:00",null,"00:00:00","00:35:00"," ","     ---   ",""," ","",null,0,null,null,null,null,null,null,null,null,null,"",{"$f":"IF(AA24=\"\",\"\",MAX(Z$9:Z23)+1)","v":""},""]
["Do","06:00:00","2022-07-15","00:00:00","00:00:00",null,"00:00:00","00:35:00"," ","     ---   ",""," ","",null,0,null,null,null,null,null,null,null,null,null,"",{"$f":"IF(AA25=\"\",\"\",MAX(Z$9:Z24)+1)","v":""},""]
["Fr","06:00:00","2022-07-16","00:00:00","00:00:00",null,"00:00:00","00:35:00"," ","     ---   ",""," ","",null,0,null,null,null,null,null,null,null,null,null,"",{"$f":"IF(AA26=\"\",\"\",MAX(Z$9:Z25)+1)","v":""},""]
["Sa","0:00","2022-07-17","00:00:00","00:00:00",null,"00:00:00","00:35:00"," ","     ---   ",""," ","",null,0,null,null,null,null,null,null,null,null,null,"",{"$f":"IF(AA27=\"\",\"\",MAX(Z$9:Z26)+1)","v":""},""]
["So","0:00","2022-07-18","00:00:00","00:00:00",null,"00:00:00","00:35:00"," ","     ---   ",""," ","",null,0,null,null,null,null,null,null,null,null,null,"",{"$f":"IF(AA28=\"\",\"\",MAX(Z$9:Z27)+1)","v":""},""]
["Mo","06:00:00","2022-07-19","00:00:00","00:00:00",null,"00:00:00","00:35:00"," ","     ---   ",""," ","",null,0,null,null,null,null,null,null,null,null,null,"",{"$f":"IF(AA29=\"\",\"\",MAX(Z$9:Z28)+1)","v":""},""]
["Di","06:00:00","2022-07-20","00:00:00","00:00:00",null,"00:00:00","00:35:00"," ","     ---   ",""," ","",null,0,null,null,null,null,null,null,null,null,null,"",{"$f":"IF(AA30=\"\",\"\",MAX(Z$9:Z29)+1)","v":""},""]
["Mi","06:00:00","2022-07-21","00:00:00","00:00:00",null,"00:00:00","00:35:00"," ","     ---   ",""," ","",null,0,null,null,null,null,null,null,null,null,null,"",{"$f":"IF(AA31=\"\",\"\",MAX(Z$9:Z30)+1)","v":""},""]
["Do","06:00:00","2022-07-22","00:00:00","00:00:00",null,"00:00:00","00:35:00"," ","     ---   ",""," ","",null,0,null,null,null,null,null,null,null,null,null,"",{"$f":"IF(AA32=\"\",\"\",MAX(Z$9:Z31)+1)","v":""},""]
["Fr","06:00:00","2022-07-23","00:00:00","00:00:00",null,"00:00:00","00:35:00"," ","     ---   ",""," ","",null,0,null,null,null,null,null,null,null,null,null,"",{"$f":"IF(AA33=\"\",\"\",MAX(Z$9:Z32)+1)","v":""},""]
["Sa","0:00","2022-07-24","00:00:00","00:00:00",null,"00:00:00","00:35:00"," ","     ---   ",""," ","",null,0,null,null,null,null,null,null,null,null,null,"",{"$f":"IF(AA34=\"\",\"\",MAX(Z$9:Z33)+1)","v":""},""]
["So","0:00","2022-07-25","00:00:00","00:00:00",null,"00:00:00","00:35:00"," ","     ---   ",""," ","",null,0,null,null,null,null,null,null,null,null,null,"",{"$f":"IF(AA35=\"\",\"\",MAX(Z$9:Z34)+1)","v":""},""]
["Mo","06:00:00","2022-07-26","00:00:00","00:00:00",null,"00:00:00","00:35:00"," ","     ---   ",""," ","",null,0,null,null,null,null,null,null,null,null,null,"",{"$f":"IF(AA36=\"\",\"\",MAX(Z$9:Z35)+1)","v":""},""]
["Di","06:00:00","2022-07-27","00:00:00","00:00:00",null,"00:00:00","00:35:00"," ","     ---   ",""," ","",null,0,null,null,null,null,null,null,null,null,null,"",{"$f":"IF(AA37=\"\",\"\",MAX(Z$9:Z36)+1)","v":""},""]
["Mi","06:00:00","2022-07-28","00:00:00","00:00:00",null,"00:00:00","00:35:00"," ","     ---   ",""," ","",null,0,null,null,null,null,null,null,null,null,null,"",{"$f":"IF(AA38=\"\",\"\",MAX(Z$9:Z37)+1)","v":""},""]
["Do","06:00:00","2022-07-29","00:00:00","00:00:00",null,"00:00:00","00:35:00"," ","     ---   ",""," ","",null,0,null,null,null,null,null,null,null,null,null,"",{"$f":"IF(AA39=\"\",\"\",MAX(Z$9:Z38)+1)","v":""},""]
["Fr","06:00:00","2022-07-30","00:00:00","00:00:00",null,"00:00:00","00:35:00"," ","     ---   ",""," ","",null,0,null,null,null,null,null,null,null,null,null,"",{"$f":"IF(AA40=\"\",\"\",MAX(Z$9:Z39)+1)","v":""},""]
[null,null,null,null,null,null,null,null,null,{"$f":"SUM(J10:J40)","v":0},"Mon.saldo",{"$f":"J41","v":0},null,null,null,null,null,null,null,null,null,null,null,null,null,{"$f":"MAX(Z9:Z40)","v":0},{"$f":"COUNT(AA10:AA40)","v":0}]
[null,null,null,null,null,null,null,null,null,"+ Saldo / Vormonate",null,{"$f":"Juni!L44","v":-0.19097222222222227},{"$f":"VLOOKUP($J$4,Tabelle_Kürzel_Abwesenheit,Spalte_GT_Monat,FALSE)","v":0},"Ganztäg. Zeitentnahmen lfd. Monat",null,{"$f":"VLOOKUP($J$4,Tabelle_Kürzel_Abwesenheit,Spalte_U_Monat,FALSE)","v":0},"Urlaub lfd. Monat",{"$f":"VLOOKUP($J$4,Tabelle_Kürzel_Abwesenheit,Spalte_K_Monat,FALSE)","v":0},"krank lfd. Monat"]
[null,null,null,null,null,null,null,null,null,"- Auszahlungen",null,0,{"$f":"VLOOKUP($J$4,Tabelle_Kürzel_Abwesenheit,Spalte_GT_Summe,FALSE)","v":0},"Ganztäg. Zeitentnahmen Jahr",null,{"$f":"VLOOKUP($J$4,Tabelle_Kürzel_Abwesenheit,Spalte_U_Summe,FALSE)","v":0},"Urlaub Jahr",{"$f":"VLOOKUP($J$4,Tabelle_Kürzel_Abwesenheit,Spalte_K_Summe,FALSE)","v":0},"krank Jahr"]
[null,null,null,null,null,null,null,null,null,"Gesamtsaldo",null,{"$f":"SUM(L41:L42)-L43","v":-0.19097222222222227}]
[]
[null,null,"Vorgesetzten-",null,{"$f":"E4","v":"2021-12-31"},null,null,null,{"$f":"I4","v":"Monat:"},null,null,null,null,{"$f":"M4","v":"Vertragliche regelmäßige Wochenarbeitszeit: "},{"$f":"Y5","v":30},{"$f":"P5","v":"Std/Woche"}]
[null,null,"Meldung",null,null,null,null,null,null,{"$f":"J4","v":"Juli"}]
[null,null,{"$f":"C6","v":"Name:"},{"$f":"D6","v":0},null,null,{"$f":"G6","v":"Vorname:"},{"$f":"H6","v":0},null,null,null,null,{"$f":"M6","v":0}]
[null,null,null,null,null,null,null,null,null,{"$f":"J6","v":"Pers.-Nr.:"},{"$f":"K6","v":0},"Abteilung/Kostenstelle:",null,"Bemerkungen"]
[null,null,{"$f":"C8","v":"Datum"},"Kommen","Gehen","Anwesenh.",{"$f":"G8","v":"Gesamtzeit"},"Mittag","Arbeitszeit",{"$f":"J8","v":"Stunden"},"Bemerkungen"]
[null,null,"Tag","08:00:00","14:35:00","abs. u. TZ","10:00:00","00:35:00","06:00:00",{"$f":"J9","v":"Saldo"},null,"Hinweise",{"$f":"M9","v":"FT/U/GT/SD/K"}]
[{"$f":"A10","v":"Mi"},"06:00:00","2022-06-30",{"$f":"IF(D10=0,\" \",IF(OR($A52=\"Sa\",$A52=\"So\",$M52=\"FT\"),D10,IF(D10<$D$84,D10,\" \")))","v":" "},{"$f":"IF(E10=0,\" \",IF(OR($A52=\"Sa\",$A52=\"So\",$M52=\"FT\"),E10,IF(E10>$D$85,E10,\" \")))","v":" "},null,{"$f":"IF(G10=0,\" \",IF(G10-H10-O10>$H$85,G10,\" \"))","v":" "},{"$f":"IF(K10=\"->Pause<-\",\"Pause!\",\"\")","v":""},null,null,{"$f":"IF(G52<>\" \",\"AZ > 10 h\",\" \")","v":" "},{"$f":"IF(ISERROR(VLOOKUP(C52,Feiertage,2,FALSE))=TRUE,IF(E52<>\" \",\"Kommen/Gehen vor/nach 06:30/20:00\",IF(D52<>\" \",\"Kommen/Gehen vor/nach 06:30/20:00\",\" \")),VLOOKUP(C52,Feiertage,2,FALSE))","v":" "},{"$f":"IF(Y10>0,Y10,\" \")","v":""},null,null,null,null,null,null,null,null,null,null,null,{"$f":"Y10","v":""}]
["Do","06:00:00","2022-07-01"," "," ",null," ",{"$f":"IF(K11=\"->Pause<-\",\"Pause!\",\"\")","v":""},null,null," "," ",{"$f":"IF(Y11>0,Y11,\" \")","v":""},null,null,null,null,null,null,null,null,null,null,null,""]
["Fr","06:00:00","2022-07-02"," "," ",null," ","",null,null," "," ","",null,null,null,null,null,null,null,null,null,null,null,""]
["Sa","0:00","2022-07-03"," "," ",null," ","",null,null," "," ","",null,null,null,null,null,null,null,null,null,null,null,""]
["So","0:00","2022-07-04"," "," ",null," ","",null,null," "," ","",null,null,null,null,null,null,null,null,null,null,null,""]
["Mo","06:00:00","2022-07-05"," "," ",null," ","",null,null," "," ","",null,null,null,null,null,null,null,null,null,null,null,""]
["Di","06:00:00","2022-07-06"," "," ",null," ","",null,null," "," ","",null,null,null,null,null,null,null,null,null,null,null,""]
["Mi","06:00:00","2022-07-07"," "," ",null," ","",null,null," "," ","",null,null,null,null,null,null,null,null,null,null,null,""]
["Do","06:00:00","2022-07-08"," "," ",null," ","",null,null," "," ","",null,null,null,null,null,null,null,null,null,null,null,""]
["Fr","06:00:00","2022-07-09"," "," ",null," ","",null,null," "," ","",null,null,null,null,null,null,null,null,null,null,null,""]
["Sa","0:00","2022-07-10"," "," ",null," ","",null,null," "," ","",null,null,null,null,null,null,null,null,null,null,null,""]
["So","0:00","2022-07-11"," "," ",null," ","",null,null," "," ","",null,null,null,null,null,null,null,null,null,null,null,""]
["Mo","06:00:00","2022-07-12"," "," ",null," ","",null,null," "," ","",null,null,null,null,null,null,null,null,null,null,null,""]
["Di","06:00:00","2022-07-13"," "," ",null," ","",null,null," "," ","",null,null,null,null,null,null,null,null,null,null,null,""]
["Mi","06:00:00","2022-07-14"," "," ",null," ","",null,null," "," ","",null,null,null,null,null,null,null,null,null,null,null,""]
["Do","06:00:00","2022-07-15"," "," ",null," ","",null,null," "," ","",null,null,null,null,null,null,null,null,null,null,null,""]
["Fr","06:00:00","2022-07-16"," "," ",null," ","",null,null," "," ","",null,null,null,null,null,null,null,null,null,null,null,""]
["Sa","0:00","2022-07-17"," "," ",null," ","",null,null," "," ","",null,null,null,null,null,null,null,null,null,null,null,""]
["So","0:00","2022-07-18"," "," ",null," ","",null,null," "," ","",null,null,null,null,null,null,null,null,null,null,null,""]
["Mo","06:00:00","2022-07-19"," "," ",null," ","",null,null," "," ","",null,null,null,null,null,null,null,null,null,null,null,""]
["Di","06:00:00","2022-07-20"," "," ",null," ","",null,null," "," ","",null,null,null,null,null,null,null,null,null,null,null,""]
["Mi","06:00:00","2022-07-21"," "," ",null," ","",null,null," "," ","",null,null,null,null,null,null,null,null,null,null,null,""]
["Do","06:00:00","2022-07-22"," "," ",null," ","",null,null," "," ","",null,null,null,null,null,null,null,null,null,null,null,""]
["Fr","06:00:00","2022-07-23"," "," ",null," ","",null,null," "," ","",null,null,null,null,null,null,null,null,null,null,null,""]
["Sa","0:00","2022-07-24"," "," ",null," ","",null,null," "," ","",null,null,null,null,null,null,null,null,null,null,null,""]
["So","0:00","2022-07-25"," "," ",null," ","",null,null," "," ","",null,null,null,null,null,null,null,null,null,null,null,""]
["Mo","06:00:00","2022-07-26",{"$f":"IF(D36=0,\" \",IF(OR($A78=\"Sa\",$A78=\"So\",$M78=\"FT\"),D36,IF(D36<$D$84,D36,\" \")))","v":" "},{"$f":"IF(E36=0,\" \",IF(OR($A78=\"Sa\",$A78=\"So\",$M78=\"FT\"),E36,IF(E36>$D$85,E36,\" \")))","v":" "},null,{"$f":"IF(G36=0,\" \",IF(G36-H36-O36>$H$85,G36,\" \"))","v":" "},"",null,null," "," ","",null,null,null,null,null,null,null,null,null,null,null,""]
["Di","06:00:00","2022-07-27",{"$f":"IF(D37=0,\" \",IF(OR($A79=\"Sa\",$A79=\"So\",$M79=\"FT\"),D37,IF(D37<$D$84,D37,\" \")))","v":" "},{"$f":"IF(E37=0,\" \",IF(OR($A79=\"Sa\",$A79=\"So\",$M79=\"FT\"),E37,IF(E37>$D$85,E37,\" \")))","v":" "},null,{"$f":"IF(G37=0,\" \",IF(G37-H37-O37>$H$85,G37,\" \"))","v":" "},"",null,null," "," ","",null,null,null,null,null,null,null,null,null,null,null,""]
["Mi","06:00:00","2022-07-28",{"$f":"IF(D38=0,\" \",IF(OR($A80=\"Sa\",$A80=\"So\",$M80=\"FT\"),D38,IF(D38<$D$84,D38,\" \")))","v":" "},{"$f":"IF(E38=0,\" \",IF(OR($A80=\"Sa\",$A80=\"So\",$M80=\"FT\"),E38,IF(E38>$D$85,E38,\" \")))","v":" "},null,{"$f":"IF(G38=0,\" \",IF(G38-H38-O38>$H$85,G38,\" \"))","v":" "},"",null,null," "," ","",null,null,null,null,null,null,null,null,null,null,null,""]
["Do","06:00:00","2022-07-29",{"$f":"IF(D39=0,\" \",IF(OR($A81=\"Sa\",$A81=\"So\",$M81=\"FT\"),D39,IF(D39<$D$84,D39,\" \")))","v":" "},{"$f":"IF(E39=0,\" \",IF(OR($A81=\"Sa\",$A81=\"So\",$M81=\"FT\"),E39,IF(E39>$D$85,E39,\" \")))","v":" "},null,{"$f":"IF(G39=0,\" \",IF(G39-H39-O39>$H$85,G39,\" \"))","v":" "},"",null,null," "," ","",null,null,null,null,null,null,null,null,null,null,null,""]
["Fr","06:00:00","2022-07-30",{"$f":"IF(D40=0,\" \",IF(OR($A82=\"Sa\",$A82=\"So\",$M82=\"FT\"),D40,IF(D40<$D$84,D40,\" \")))","v":" "},{"$f":"IF(E40=0,\" \",IF(OR($A82=\"Sa\",$A82=\"So\",$M82=\"FT\"),E40,IF(E40>$D$85,E40,\" \")))","v":" "},null,{"$f":"IF(G40=0,\" \",IF(G40-H40-O40>$H$85,G40,\" \"))","v":" "},"",null,null," "," ","",null,null,null,null,null,null,null,null,null,null,null,""]
[null,null,"Meldegründe:",null,null,null,null,null,null,null,{"$f":"K41","v":"Mon.saldo"}]
[null,null,"vor","06:30:00",null,null,"Über 60 Stunden",{"$f":"H85*6","v":2.5},"Gesamtsaldo",{"$f":"J42","v":"+ Saldo / Vormonate"},null,null,{"$f":"M42","v":0},{"$f":"N42","v":"Ganztäg. Zeitentnahmen lfd. Monat"}]
[null,null,"nach ","20:00:00",null,null,"Über",{"$f":"G9","v":"10:00:00"},"Std. tägl.","- Auszahlungen",null,{"$f":"L43","v":0},{"$f":"M43","v":0},{"$f":"N43","v":"Ganztäg. Zeitentnahmen Jahr"}]
[{"$f":"Januar!A87","v":"V 2026.1"},null,{"$f":"\"mobile Work / Telearbeit: \"&IF(H4=\"Ja\",'mW-HO'!U37&\"%\",\"n.a.\")","v":"mobile Work / Telearbeit: 0%"},null,null,null,"unter -20 Stunden",{"$f":"-H85*2","v":-0.83333333333333337},"Gesamtsaldo",{"$f":"J44","v":"Gesamtsaldo"},null,{"$f":"IF(H84>L44,\" \",L44)","v":" "}]
[null,null,null,null,null,null,null,null,null,null,null,{"$f":"IF(H86>L44,L44,\" \")","v":" "}]

{"sheet":"August","index":8,"n_rows":87,"n_cols":27,"rows_kept":87,"cut":false,"hidden":false,"merged":[[7,19,7,22],[7,15,7,18],[85,2,85,4],[6,11,6,13],[0,0,0,1],[1,0,1,1],[47,3,47,4],[47,7,47,8],[5,7,5,8],[5,3,5,4],[3,5,3,6]]}
[{"$f":"L44","v":-0.19097222222222227},null,"Gesamtsaldo",null,null,null,null,null,null,null,null,null,null,null,null,"Tages-","Mo",{"$f":"INDIRECT(\"'\"&$Y$2&\"'!\"&CELL(\"address\",R1))","v":0.25},null,null,null,null,null,null,"Hilfsspalte","Urlaubstage"]
[{"$f":"L41","v":0},null,"Dieser Monat",null,null,null,null,null,null,null,null,null,null,null,null,"arbeitszeit","Di",0.25,null,null,null,null,null,null,"Juli"]
[null,null,null,null,null,null,null,null,null,null,null,null,null,null,null,null,"Mi",0.25]
[null,null,"Anwesenheitsliste",null,{"$f":"Januar!E4","v":"2021-12-31"},"Report HO/mW Stat.:",null,"Ja","Monat:",{"$f":"VLOOKUP(MONTH(C10),Text_Monatsname,2,FALSE)","v":"August"},null,null,"Vertragliche regelmäßige Wochenarbeitszeit: ","\"hh:mm\"",{"$f":"IF(INDIRECT(\"'\"&$Y$2&\"'!\"&CELL(\"address\",O4))=\"\",\"\",INDIRECT(\"'\"&$Y$2&\"'!\"&CELL(\"address\",O4)))","v":1.25},null,"Do",0.25,null,null,null,null,null,null,{"$f":"Y5*Y6","v":1.25}]
[null,null,null,null,null,null,null,null,null,null,null,null,null,"oder: Industrieminuten \"hh,<1/10 h>\"",{"$f":"IF(INDIRECT(\"'\"&$Y$2&\"'!\"&CELL(\"address\",O5))=\"\",\"\",INDIRECT(\"'\"&$Y$2&\"'!\"&CELL(\"address\",O5)))","v":""},"Std/Woche","Fr",0.25,{"$f":"SUM(R1:R7)","v":1.25},null,null,null,null,null,{"$f":"IF(O4<>\"\",IF(O5=\"\",(DAY(O4)*24-24)+HOUR(O4)+MINUTE(O4)/60,IF(O5*Y6=O4,O5,\"Fehler\")),IF(O5<>\"\",O5,\"Fehler\"))","v":30}]
[null,null,"Name:",{"$f":"INDIRECT(\"'\"&$Y$2&\"'!\"&CELL(\"address\",D6))","v":0},null,null,"Vorname:",{"$f":"INDIRECT(\"'\"&$Y$2&\"'!\"&CELL(\"address\",H6))","v":0},null,"Pers.-Nr.:",{"$f":"INDIRECT(\"'\"&$Y$2&\"'!\"&CELL(\"address\",K6))","v":0},"Abteilung/Kostenstelle:",{"$f":"INDIRECT(\"'\"&$Y$2&\"'!\"&CELL(\"address\",M6))","v":0},null,{"$f":"IF(Y5=\"Fehler\",\"nur ein Wert!\",\"\")","v":""},"Mittagspause","Sa",0,{"$f":"IF(Y4=S5,\"Saldo O.K.\",\"Saldo falsch\")","v":"Saldo O.K."},null,null,null,null,null,"01:00:00"]
[null,null,null,null,null,null,null,null,null,null,null,"Mittagspause (Ja / Nein)  ",null,null,{"$f":"INDIRECT(\"'\"&$Y$2&\"'!\"&CELL(\"address\",O7))","v":"Ja"},{"$f":"INDIRECT(\"'\"&$Y$2&\"'!\"&CELL(\"address\",P7))","v":"00:35:00"},"So",0]
[null,"Soll","Datum","Kommen","Gehen","Anwesenh.","Gesamtzeit","Mittag","Arbeitszeit","Stunden","Bemerkungen",null,"Dienstl./Sonstige Abwesenheit",null,null,"Dokumentation sonstige Abwesenheit",null,null,null,"zusätzliche Reisezeit"]
[null,"Std","Tag","08:00:00",{"$f":"D9+I9+H9","v":"14:35:00"},"abs. u. TZ","10:00:00",{"$f":"IF(O7=\"NEIN\",0,P7)","v":"00:35:00"},{"$f":"Y4/5","v":"06:00:00"},"Saldo",null,"Hinweise","FT/U/GT/SD/K","SAR","Korrektur","von","bis","von","bis","von","bis","von","bis",null,null,{"$f":"VLOOKUP(J4,Werte_UrlaubstageProMonat,2,FALSE)","v":0}]
[{"$f":"VLOOKUP(WEEKDAY(C10,2),Text_Wochentag,2)","v":"Sa"},{"$f":"IF(OR(A10=\"Sa\",A10=\"So\"),\"0:00\",IF(Y10=\"FT\",\"0:00\",$I$9))","v":"0:00"},{"$f":"Juli!C40+1","v":"2022-07-31"},"00:00:00","00:00:00",null,{"$f":"IF(I10=\" \",0,I10 + IF(N10=\"Ja\", (U10-T10) + (W10-V10),0))","v":"00:00:00"},{"$f":"$H$9","v":"00:35:00"},{"$f":"IFERROR(IF(E10=0,IF(D10=0,\" \",E10-D10+F10-H10),TIME(HOUR(E10-D10+F10),MINUTE(E10-D10+F10),0)-H10) - IF(N10=\"Ja\",(Q10-P10) + (S10-R10),0),\" \")","v":" "},{"$f":"IF(Y10=\"GT\",-B10,IF(E10>0,G10-B10,IF(F10>0,G10-B10,\"     ---   \")))","v":"     ---   "},{"$f":"IF(G10<0,$I$9+D10+H10+O10, IFERROR(IF(OR(AND((I10*24)>9,((H10+IF(N10=\"Ja\",(Q10-P10)+(S10-R10),0))*24*60)<45),AND((I10*24)>6,((H10+IF(N10=\"Ja\",(Q10-P10)+(S10-R10),0))*24*60)<30)),\"->Pause<-\",\"\"),\"\"))","v":""},{"$f":"IF(ISERROR(VLOOKUP(C10,Feiertage,2,FALSE))=TRUE,IF(G10<0,\"Uhr  mind. Arbeitszeit\",IF(AND(I10<>\" \",I10>$G$9),\"Arbeitszeit >10 Std.\",\" \")),VLOOKUP(C10,Feiertage,2,FALSE))","v":" "},{"$f":"IF(ISERROR(VLOOKUP(C10,Feiertage,2,FALSE))=TRUE,\"\",\"FT\")","v":""},null,{"$f":"IF(N10=\"Ja\",((U10-T10)+(W10-V10))-((Q10-P10)+(S10-R10)),0)","v":0},null,null,null,null,null,null,null,null,null,{"$f":"UPPER(TRIM(M10))","v":""},{"$f":"IF(AA10=\"\",\"\",MAX(Z$9:Z9)+1)","v":""},{"$f":"IF(M10=\"U\",C10,\"\")","v":""}]
["So",{"$f":"IF(OR(A11=\"Sa\",A11=\"So\"),\"0:00\",IF(Y11=\"FT\",\"0:00\",$I$9))","v":"0:00"},{"$f":"C10+1","v":"2022-08-01"},"00:00:00","00:00:00",null,{"$f":"IF(I11=\" \",0,I11 + IF(N11=\"Ja\", (U11-T11) + (W11-V11),0))","v":"00:00:00"},"00:35:00",{"$f":"IFERROR(IF(E11=0,IF(D11=0,\" \",E11-D11+F11-H11),TIME(HOUR(E11-D11+F11),MINUTE(E11-D11+F11),0)-H11) - IF(N11=\"Ja\",(Q11-P11) + (S11-R11),0),\" \")","v":" "},{"$f":"IF(Y11=\"GT\",-B11,IF(E11>0,G11-B11,IF(F11>0,G11-B11,\"     ---   \")))","v":"     ---   "},{"$f":"IF(G11<0,$I$9+D11+H11+O11, IFERROR(IF(OR(AND((I11*24)>9,((H11+IF(N11=\"Ja\",(Q11-P11)+(S11-R11),0))*24*60)<45),AND((I11*24)>6,((H11+IF(N11=\"Ja\",(Q11-P11)+(S11-R11),0))*24*60)<30)),\"->Pause<-\",\"\"),\"\"))","v":""}," ","",null,{"$f":"IF(N11=\"Ja\",((U11-T11)+(W11-V11))-((Q11-P11)+(S11-R11)),0)","v":0},null,null,null,null,null,null,null,null,null,"",{"$f":"IF(AA11=\"\",\"\",MAX(Z$9:Z10)+1)","v":""},{"$f":"IF(M11=\"U\",C11,\"\")","v":""}]
["Mo","06:00:00","2022-08-02","00:00:00","00:00:00",null,"00:00:00","00:35:00"," ","     ---   ",""," ","",null,0,null,null,null,null,null,null,null,null,null,"",{"$f":"IF(AA12=\"\",\"\",MAX(Z$9:Z11)+1)","v":""},""]
["Di","06:00:00","2022-08-03","00:00:00","00:00:00",null,"00:00:00","00:35:00"," ","     ---   ",""," ","",null,0,null,null,null,null,null,null,null,null,null,"",{"$f":"IF(AA13=\"\",\"\",MAX(Z$9:Z12)+1)","v":""},""]
["Mi","06:00:00","2022-08-04","00:00:00","00:00:00",null,"00:00:00","00:35:00"," ","     ---   ",""," ","",null,0,null,null,null,null,null,null,null,null,null,"",{"$f":"IF(AA14=\"\",\"\",MAX(Z$9:Z13)+1)","v":""},""]
["Do","06:00:00","2022-08-05","00:00:00","00:00:00",null,"00:00:00","00:35:00"," ","     ---   ",""," ",null,null,0,null,null,null,null,null,null,null,null,null,"",{"$f":"IF(AA15=\"\",\"\",MAX(Z$9:Z14)+1)","v":""},""]
["Fr","06:00:00","2022-08-06","00:00:00","00:00:00",null,"00:00:00","00:35:00"," ","     ---   ",""," ","",null,0,null,null,null,null,null,null,null,null,null,"",{"$f":"IF(AA16=\"\",\"\",MAX(Z$9:Z15)+1)","v":""},""]
["Sa","0:00","2022-08-07","00:00:00","00:00:00",null,"00:00:00","00:35:00"," ","     ---   ",""," ",null,null,0,null,null,null,null,null,null,null,null,null,"",{"$f":"IF(AA17=\"\",\"\",MAX(Z$9:Z16)+1)","v":""},""]
["So","0:00","2022-08-08","00:00:00","00:00:00",null,"00:00:00","00:35:00"," ","     ---   ",""," ","",null,0,null,null,null,null,null,null,null,null,null,"",{"$f":"IF(AA18=\"\",\"\",MAX(Z$9:Z17)+1)","v":""},""]
["Mo","06:00:00","2022-08-09","00:00:00","00:00:00",null,"00:00:00","00:35:00"," ","     ---   ",""," ","",null,0,null,null,null,null,null,null,null,null,null,"",{"$f":"IF(AA19=\"\",\"\",MAX(Z$9:Z18)+1)","v":""},""]
["Di","06:00:00","2022-08-10","00:00:00","00:00:00",null,"00:00:00","00:35:00"," ","     ---   ",""," ","",null,0,null,null,null,null,null,null,null,null,null,"",{"$f":"IF(AA20=\"\",\"\",MAX(Z$9:Z19)+1)","v":""},""]
["Mi","06:00:00","2022-08-11","00:00:00","00:00:00",null,"00:00:00","00:35:00"," ","     ---   ",""," ","",null,0,null,null,null,null,null,null,null,null,null,"",{"$f":"IF(AA21=\"\",\"\",MAX(Z$9:Z20)+1)","v":""},""]
["Do","06:00:00","2022-08-12","00:00:00","00:00:00",null,"00:00:00","00:35:00"," ","     ---   ",""," ","",null,0,null,null,null,null,null,null,null,null,null,"",{"$f":"IF(AA22=\"\",\"\",MAX(Z$9:Z21)+1)","v":""},""]
["Fr","06:00:00","2022-08-13","00:00:00","00:00:00",null,"00:00:00","00:35:00"," ","     ---   ",""," ",null,null,0,null,null,null,null,null,null,null,null,null,"",{"$f":"IF(AA23=\"\",\"\",MAX(Z$9:Z22)+1)","v":""},""]
["Sa","0:00","2022-08-14","00:00:00","00:00:00",null,"00:00:00","00:35:00"," ","     ---   ","","Mariä Himmelfahrt","FT",null,0,null,null,null,null,null,null,null,null,null,"FT",{"$f":"IF(AA24=\"\",\"\",MAX(Z$9:Z23)+1)","v":""},""]
["So","0:00","2022-08-15","00:00:00","00:00:00",null,"00:00:00","00:35:00"," ","     ---   ",""," ","",null,0,null,null,null,null,null,null,null,null,null,"",{"$f":"IF(AA25=\"\",\"\",MAX(Z$9:Z24)+1)","v":""},""]
["Mo","06:00:00","2022-08-16","00:00:00","00:00:00",null,"00:00:00","00:35:00"," ","     ---   ",""," ","",null,0,null,null,null,null,null,null,null,null,null,"",{"$f":"IF(AA26=\"\",\"\",MAX(Z$9:Z25)+1)","v":""},""]
["Di","06:00:00","2022-08-17","00:00:00","00:00:00",null,"00:00:00","00:35:00"," ","     ---   ",""," ","",null,0,null,null,null,null,null,null,null,null,null,"",{"$f":"IF(AA27=\"\",\"\",MAX(Z$9:Z26)+1)","v":""},""]
["Mi","06:00:00","2022-08-18","00:00:00","00:00:00",null,"00:00:00","00:35:00"," ","     ---   ",""," ","",null,0,null,null,null,null,null,null,null,null,null,"",{"$f":"IF(AA28=\"\",\"\",MAX(Z$9:Z27)+1)","v":""},""]
["Do","06:00:00","2022-08-19","00:00:00","00:00:00",null,"00:00:00","00:35:00"," ","     ---   ",""," ","",null,0,null,null,null,null,null,null,null,null,null,"",{"$f":"IF(AA29=\"\",\"\",MAX(Z$9:Z28)+1)","v":""},""]
["Fr","06:00:00","2022-08-20","00:00:00","00:00:00",null,"00:00:00","00:35:00"," ","     ---   ",""," ","",null,0,null,null,null,null,null,null,null,null,null,"",{"$f":"IF(AA30=\"\",\"\",MAX(Z$9:Z29)+1)","v":""},""]
["Sa","0:00","2022-08-21","00:00:00","00:00:00",null,"00:00:00","00:35:00"," ","     ---   ",""," ","",null,0,null,null,null,null,null,null,null,null,null,"",{"$f":"IF(AA31=\"\",\"\",MAX(Z$9:Z30)+1)","v":""},""]
["So","0:00","2022-08-22","00:00:00","00:00:00",null,"00:00:00","00:35:00"," ","     ---   ",""," ","",null,0,null,null,null,null,null,null,null,null,null,"",{"$f":"IF(AA32=\"\",\"\",MAX(Z$9:Z31)+1)","v":""},""]
["Mo","06:00:00","2022-08-23","00:00:00","00:00:00",null,"00:00:00","00:35:00"," ","     ---   ",""," ","",null,0,null,null,null,null,null,null,null,null,null,"",{"$f":"IF(AA33=\"\",\"\",MAX(Z$9:Z32)+1)","v":""},""]
["Di","06:00:00","2022-08-24","00:00:00","00:00:00",null,"00:00:00","00:35:00"," ","     ---   ",""," ",null,null,0,null,null,null,null,null,null,null,null,null,"",{"$f":"IF(AA34=\"\",\"\",MAX(Z$9:Z33)+1)","v":""},""]
["Mi","06:00:00","2022-08-25","00:00:00","00:00:00",null,"00:00:00","00:35:00"," ","     ---   ",""," ","",null,0,null,null,null,null,null,null,null,null,null,"",{"$f":"IF(AA35=\"\",\"\",MAX(Z$9:Z34)+1)","v":""},""]
["Do","06:00:00","2022-08-26","00:00:00","00:00:00",null,"00:00:00","00:35:00"," ","     ---   ",""," ","",null,0,null,null,null,null,null,null,null,null,null,"",{"$f":"IF(AA36=\"\",\"\",MAX(Z$9:Z35)+1)","v":""},""]
["Fr","06:00:00","2022-08-27","00:00:00","00:00:00",null,"00:00:00","00:35:00"," ","     ---   ",""," ","",null,0,null,null,null,null,null,null,null,null,null,"",{"$f":"IF(AA37=\"\",\"\",MAX(Z$9:Z36)+1)","v":""},""]
["Sa","0:00","2022-08-28","00:00:00","00:00:00",null,"00:00:00","00:35:00"," ","     ---   ",""," ","",null,0,null,null,null,null,null,null,null,null,null,"",{"$f":"IF(AA38=\"\",\"\",MAX(Z$9:Z37)+1)","v":""},""]
["So","0:00","2022-08-29","00:00:00","00:00:00",null,"00:00:00","00:35:00"," ","     ---   ",""," ","",null,0,null,null,null,null,null,null,null,null,null,"",{"$f":"IF(AA39=\"\",\"\",MAX(Z$9:Z38)+1)","v":""},""]
["Mo","06:00:00","2022-08-30","00:00:00","00:00:00",null,"00:00:00","00:35:00"," ","     ---   ",""," ","",null,0,null,null,null,null,null,null,null,null,null,"",{"$f":"IF(AA40=\"\",\"\",MAX(Z$9:Z39)+1)","v":""},""]
[null,null,null,null,null,null,null,null,null,{"$f":"SUM(J10:J40)","v":0},"Mon.saldo",{"$f":"J41","v":0},null,null,null,null,null,null,null,null,null,null,null,null,null,{"$f":"MAX(Z9:Z40)","v":0},{"$f":"COUNT(AA10:AA40)","v":0}]
[null,null,null,null,null,null,null,null,null,"+ Saldo / Vormonate",null,{"$f":"Juli!L44","v":-0.19097222222222227},{"$f":"VLOOKUP($J$4,Tabelle_Kürzel_Abwesenheit,Spalte_GT_Monat,FALSE)","v":0},"Ganztäg. Zeitentnahmen lfd. Monat",null,{"$f":"VLOOKUP($J$4,Tabelle_Kürzel_Abwesenheit,Spalte_U_Monat,FALSE)","v":0},"Urlaub lfd. Monat",{"$f":"VLOOKUP($J$4,Tabelle_Kürzel_Abwesenheit,Spalte_K_Monat,FALSE)","v":0},"krank lfd. Monat"]
[null,null,null,null,null,null,null,null,null,"- Auszahlungen",null,0,{"$f":"VLOOKUP($J$4,Tabelle_Kürzel_Abwesenheit,Spalte_GT_Summe,FALSE)","v":0},"Ganztäg. Zeitentnahmen Jahr",null,{"$f":"VLOOKUP($J$4,Tabelle_Kürzel_Abwesenheit,Spalte_U_Summe,FALSE)","v":0},"Urlaub Jahr",{"$f":"VLOOKUP($J$4,Tabelle_Kürzel_Abwesenheit,Spalte_K_Summe,FALSE)","v":0},"krank Jahr"]
[null,null,null,null,null,null,null,null,null,"Gesamtsaldo",null,{"$f":"SUM(L41:L42)-L43","v":-0.19097222222222227}]
[]
[null,null,"Vorgesetzten-",null,{"$f":"E4","v":"2021-12-31"},null,null,null,{"$f":"I4","v":"Monat:"},null,null,null,null,{"$f":"M4","v":"Vertragliche regelmäßige Wochenarbeitszeit: "},{"$f":"Y5","v":30},{"$f":"P5","v":"Std/Woche"}]
[null,null,"Meldung",null,null,null,null,null,null,{"$f":"J4","v":"August"}]
[null,null,{"$f":"C6","v":"Name:"},{"$f":"D6","v":0},null,null,{"$f":"G6","v":"Vorname:"},{"$f":"H6","v":0},null,null,null,null,{"$f":"M6","v":0}]
[null,null,null,null,null,null,null,null,null,{"$f":"J6","v":"Pers.-Nr.:"},{"$f":"K6","v":0},"Abteilung/Kostenstelle:",null,"Bemerkungen"]
[null,null,{"$f":"C8","v":"Datum"},"Kommen","Gehen","Anwesenh.",{"$f":"G8","v":"Gesamtzeit"},"Mittag","Arbeitszeit",{"$f":"J8","v":"Stunden"},"Bemerkungen"]
[null,null,"Tag","08:00:00","14:35:00","abs. u. TZ","10:00:00","00:35:00","06:00:00",{"$f":"J9","v":"Saldo"},null,"Hinweise",{"$f":"M9","v":"FT/U/GT/SD/K"}]
[{"$f":"A10","v":"Sa"},"0:00","2022-07-31",{"$f":"IF(D10=0,\" \",IF(OR($A52=\"Sa\",$A52=\"So\",$M52=\"FT\"),D10,IF(D10<$D$84,D10,\" \")))","v":" "},{"$f":"IF(E10=0,\" \",IF(OR($A52=\"Sa\",$A52=\"So\",$M52=\"FT\"),E10,IF(E10>$D$85,E10,\" \")))","v":" "},null,{"$f":"IF(G10=0,\" \",IF(G10-H10-O10>$H$85,G10,\" \"))","v":" "},{"$f":"IF(K10=\"->Pause<-\",\"Pause!\",\"\")","v":""},null,null,{"$f":"IF(G52<>\" \",\"AZ > 10 h\",\" \")","v":" "},{"$f":"IF(ISERROR(VLOOKUP(C52,Feiertage,2,FALSE))=TRUE,IF(E52<>\" \",\"Kommen/Gehen vor/nach 06:30/20:00\",IF(D52<>\" \",\"Kommen/Gehen vor/nach 06:30/20:00\",\" \")),VLOOKUP(C52,Feiertage,2,FALSE))","v":" "},{"$f":"IF(Y10>0,Y10,\" \")","v":""},null,null,null,null,null,null,null,null,null,null,null,{"$f":"Y10","v":""}]
["So","0:00","2022-08-01"," "," ",null," ",{"$f":"IF(K11=\"->Pause<-\",\"Pause!\",\"\")","v":""},null,null," "," ",{"$f":"IF(Y11>0,Y11,\" \")","v":""},null,null,null,null,null,null,null,null,null,null,null,""]
["Mo","06:00:00","2022-08-02"," "," ",null," ","",null,null," "," ","",null,null,null,null,null,null,null,null,null,null,null,""]
["Di","06:00:00","2022-08-03"," "," ",null," ","",null,null," "," ","",null,null,null,null,null,null,null,null,null,null,null,""]
["Mi","06:00:00","2022-08-04"," "," ",null," ","",null,null," "," ","",null,null,null,null,null,null,null,null,null,null,null,""]
["Do","06:00:00","2022-08-05"," "," ",null," ","",null,null," "," ","",null,null,null,null,null,null,null,null,null,null,null,""]
["Fr","06:00:00","2022-08-06"," "," ",null," ","",null,null," "," ","",null,null,null,null,null,null,null,null,null,null,null,""]
["Sa","0:00","2022-08-07"," "," ",null," ","",null,null," "," ","",null,null,null,null,null,null,null,null,null,null,null,""]
["So","0:00","2022-08-08"," "," ",null," ","",null,null," "," ","",null,null,null,null,null,null,null,null,null,null,null,""]
["Mo","06:00:00","2022-08-09"," "," ",null," ","",null,null," "," ","",null,null,null,null,null,null,null,null,null,null,null,""]
["Di","06:00:00","2022-08-10"," "," ",null," ","",null,null," "," ","",null,null,null,null,null,null,null,null,null,null,null,""]
["Mi","06:00:00","2022-08-11"," "," ",null," ","",null,null," "," ","",null,null,null,null,null,null,null,null,null,null,null,""]
["Do","06:00:00","2022-08-12"," "," ",null," ","",null,null," "," ","",null,null,null,null,null,null,null,null,null,null,null,""]
["Fr","06:00:00","2022-08-13"," "," ",null," ","",null,null," "," ","",null,null,null,null,null,null,null,null,null,null,null,""]
["Sa","0:00","2022-08-14"," "," ",null," ","",null,null," ","Mariä Himmelfahrt","FT",null,null,null,null,null,null,null,null,null,null,null,"FT"]
["So","0:00","2022-08-15"," "," ",null," ","",null,null," "," ","",null,null,null,null,null,null,null,null,null,null,null,""]
["Mo","06:00:00","2022-08-16"," "," ",null," ","",null,null," "," ","",null,null,null,null,null,null,null,null,null,null,null,""]
["Di","06:00:00","2022-08-17"," "," ",null," ","",null,null," "," ","",null,null,null,null,null,null,null,null,null,null,null,""]
["Mi","06:00:00","2022-08-18"," "," ",null," ","",null,null," "," ","",null,null,null,null,null,null,null,null,null,null,null,""]
["Do","06:00:00","2022-08-19"," "," ",null," ","",null,null," "," ","",null,null,null,null,null,null,null,null,null,null,null,""]
["Fr","06:00:00","2022-08-20"," "," ",null," ","",null,null," "," ","",null,null,null,null,null,null,null,null,null,null,null,""]
["Sa","0:00","2022-08-21"," "," ",null," ","",null,null," "," ","",null,null,null,null,null,null,null,null,null,null,null,""]
["So","0:00","2022-08-22"," "," ",null," ","",null,null," "," ","",null,null,null,null,null,null,null,null,null,null,null,""]
["Mo","06:00:00","2022-08-23",{"$f":"IF(D33=0,\" \",IF(OR($A75=\"Sa\",$A75=\"So\",$M75=\"FT\"),D33,IF(D33<$D$84,D33,\" \")))","v":" "},{"$f":"IF(E33=0,\" \",IF(OR($A75=\"Sa\",$A75=\"So\",$M75=\"FT\"),E33,IF(E33>$D$85,E33,\" \")))","v":" "},null,{"$f":"IF(G33=0,\" \",IF(G33-H33-O33>$H$85,G33,\" \"))","v":" "},"",null,null," "," ","",null,null,null,null,null,null,null,null,null,null,null,""]
["Di","06:00:00","2022-08-24",{"$f":"IF(D34=0,\" \",IF(OR($A76=\"Sa\",$A76=\"So\",$M76=\"FT\"),D34,IF(D34<$D$84,D34,\" \")))","v":" "},{"$f":"IF(E34=0,\" \",IF(OR($A76=\"Sa\",$A76=\"So\",$M76=\"FT\"),E34,IF(E34>$D$85,E34,\" \")))","v":" "},null,{"$f":"IF(G34=0,\" \",IF(G34-H34-O34>$H$85,G34,\" \"))","v":" "},"",null,null," "," ","",null,null,null,null,null,null,null,null,null,null,null,""]
["Mi","06:00:00","2022-08-25",{"$f":"IF(D35=0,\" \",IF(OR($A77=\"Sa\",$A77=\"So\",$M77=\"FT\"),D35,IF(D35<$D$84,D35,\" \")))","v":" "},{"$f":"IF(E35=0,\" \",IF(OR($A77=\"Sa\",$A77=\"So\",$M77=\"FT\"),E35,IF(E35>$D$85,E35,\" \")))","v":" "},null,{"$f":"IF(G35=0,\" \",IF(G35-H35-O35>$H$85,G35,\" \"))","v":" "},"",null,null,{"$f":"IF(G77<>\" \",\"AZ > 10 h\",\" \")","v":" "}," ","",null,null,null,null,null,null,null,null,null,null,null,""]
["Do","06:00:00","2022-08-26"," "," ",null," ","",null,null," "," ","",null,null,null,null,null,null,null,null,null,null,null,""]
["Fr","06:00:00","2022-08-27"," "," ",null," ","",null,null," "," ","",null,null,null,null,null,null,null,null,null,null,null,""]
["Sa","0:00","2022-08-28"," "," ",null," ","",null,null," "," ","",null,null,null,null,null,null,null,null,null,null,null,""]
["So","0:00","2022-08-29"," "," ",null," ","",null,null," "," ","",null,null,null,null,null,null,null,null,null,null,null,""]
["Mo","06:00:00","2022-08-30"," "," ",null," ","",null,null," "," ","",null,null,null,null,null,null,null,null,null,null,null,""]
[null,null,"Meldegründe:",null,null,null,null,null,null,null,{"$f":"K41","v":"Mon.saldo"}]
[null,null,"vor","06:30:00",null,null,"Über 60 Stunden",{"$f":"H85*6","v":2.5},"Gesamtsaldo",{"$f":"J42","v":"+ Saldo / Vormonate"},null,null,{"$f":"M42","v":0},{"$f":"N42","v":"Ganztäg. Zeitentnahmen lfd. Monat"}]
[null,null,"nach ","20:00:00",null,null,"Über",{"$f":"G9","v":"10:00:00"},"Std. tägl.","- Auszahlungen",null,{"$f":"L43","v":0},{"$f":"M43","v":0},{"$f":"N43","v":"Ganztäg. Zeitentnahmen Jahr"}]
[{"$f":"Januar!A87","v":"V 2026.1"},null,{"$f":"\"mobile Work / Telearbeit: \"&IF(H4=\"Ja\",'mW-HO'!X37&\"%\",\"n.a.\")","v":"mobile Work / Telearbeit: 0%"},null,null,null,"unter -20 Stunden",{"$f":"-H85*2","v":-0.83333333333333337},"Gesamtsaldo",{"$f":"J44","v":"Gesamtsaldo"},null,{"$f":"IF(H84>L44,\" \",L44)","v":" "}]
[null,null,null,null,null,null,null,null,null,null,null,{"$f":"IF(H86>L44,L44,\" \")","v":" "}]

{"sheet":"September","index":9,"n_rows":87,"n_cols":27,"rows_kept":87,"cut":false,"hidden":false,"merged":[[7,19,7,22],[7,15,7,18],[85,2,85,4],[6,11,6,13],[0,0,0,1],[1,0,1,1],[48,3,48,4],[48,7,48,8],[5,7,5,8],[5,3,5,4],[3,5,3,6]]}
[{"$f":"L44","v":-0.19097222222222227},null,"Gesamtsaldo",null,null,null,null,null,null,null,null,null,null,null,null,"Tages-","Mo",{"$f":"INDIRECT(\"'\"&$Y$2&\"'!\"&CELL(\"address\",R1))","v":0.25},null,null,null,null,null,null,"Hilfsspalte","Urlaubstage"]
[{"$f":"L41","v":0},null,"Dieser Monat",null,null,null,null,null,null,null,null,null,null,null,null,"arbeitszeit","Di",0.25,null,null,null,null,null,null,"August"]
[null,null,null,null,null,null,null,null,null,null,null,null,null,null,null,null,"Mi",0.25]
[null,null,"Anwesenheitsliste",null,{"$f":"Januar!E4","v":"2021-12-31"},"Report HO/mW Stat.:",null,"Ja","Monat:",{"$f":"VLOOKUP(MONTH(C10),Text_Monatsname,2,FALSE)","v":"September"},null,null,"Vertragliche regelmäßige Wochenarbeitszeit: ","\"hh:mm\"",{"$f":"IF(INDIRECT(\"'\"&$Y$2&\"'!\"&CELL(\"address\",O4))=\"\",\"\",INDIRECT(\"'\"&$Y$2&\"'!\"&CELL(\"address\",O4)))","v":1.25},null,"Do",0.25,null,null,null,null,null,null,{"$f":"Y5*Y6","v":1.25}]
[null,null,null,null,null,null,null,null,null,null,null,null,null,"oder: Industrieminuten \"hh,<1/10 h>\"",{"$f":"IF(INDIRECT(\"'\"&$Y$2&\"'!\"&CELL(\"address\",O5))=\"\",\"\",INDIRECT(\"'\"&$Y$2&\"'!\"&CELL(\"address\",O5)))","v":""},"Std/Woche","Fr",0.25,{"$f":"SUM(R1:R7)","v":1.25},null,null,null,null,null,{"$f":"IF(O4<>\"\",IF(O5=\"\",(DAY(O4)*24-24)+HOUR(O4)+MINUTE(O4)/60,IF(O5*Y6=O4,O5,\"Fehler\")),IF(O5<>\"\",O5,\"Fehler\"))","v":30}]
[null,null,"Name:",{"$f":"INDIRECT(\"'\"&$Y$2&\"'!\"&CELL(\"address\",D6))","v":0},null,null,"Vorname:",{"$f":"INDIRECT(\"'\"&$Y$2&\"'!\"&CELL(\"address\",H6))","v":0},null,"Pers.-Nr.:",{"$f":"INDIRECT(\"'\"&$Y$2&\"'!\"&CELL(\"address\",K6))","v":0},"Abteilung/Kostenstelle:",{"$f":"INDIRECT(\"'\"&$Y$2&\"'!\"&CELL(\"address\",M6))","v":0},null,{"$f":"IF(Y5=\"Fehler\",\"nur ein Wert!\",\"\")","v":""},"Mittagspause","Sa",0,{"$f":"IF(Y4=S5,\"Saldo O.K.\",\"Saldo falsch\")","v":"Saldo O.K."},null,null,null,null,null,"01:00:00"]
[null,null,null,null,null,null,null,null,null,null,null,"Mittagspause (Ja / Nein)  ",null,null,{"$f":"INDIRECT(\"'\"&$Y$2&\"'!\"&CELL(\"address\",O7))","v":"Ja"},{"$f":"INDIRECT(\"'\"&$Y$2&\"'!\"&CELL(\"address\",P7))","v":"00:35:00"},"So",0]
[null,"Soll","Datum","Kommen","Gehen","Anwesenh.","Gesamtzeit","Mittag","Arbeitszeit","Stunden","Bemerkungen",null,"Dienstl./Sonstige Abwesenheit",null,null,"Dokumentation sonstige Abwesenheit",null,null,null,"zusätzliche Reisezeit"]
[null,"Std","Tag","08:00:00",{"$f":"D9+I9+H9","v":"14:35:00"},"abs. u. TZ","10:00:00",{"$f":"IF(O7=\"NEIN\",0,P7)","v":"00:35:00"},{"$f":"Y4/5","v":"06:00:00"},"Saldo",null,"Hinweise","FT/U/GT/SD/K","SAR","Korrektur","von","bis","von","bis","von","bis","von","bis",null,null,{"$f":"VLOOKUP(J4,Werte_UrlaubstageProMonat,2,FALSE)","v":0}]
[{"$f":"VLOOKUP(WEEKDAY(C10,2),Text_Wochentag,2)","v":"Di"},{"$f":"IF(OR(A10=\"Sa\",A10=\"So\"),\"0:00\",IF(Y10=\"FT\",\"0:00\",$I$9))","v":"06:00:00"},{"$f":"August!C40+1","v":"2022-08-31"},"00:00:00","00:00:00",null,{"$f":"IF(I10=\" \",0,I10 + IF(N10=\"Ja\", (U10-T10) + (W10-V10),0))","v":"00:00:00"},{"$f":"$H$9","v":"00:35:00"},{"$f":"IFERROR(IF(E10=0,IF(D10=0,\" \",E10-D10+F10-H10),TIME(HOUR(E10-D10+F10),MINUTE(E10-D10+F10),0)-H10) - IF(N10=\"Ja\",(Q10-P10) + (S10-R10),0),\" \")","v":" "},{"$f":"IF(Y10=\"GT\",-B10,IF(E10>0,G10-B10,IF(F10>0,G10-B10,\"     ---   \")))","v":"     ---   "},{"$f":"IF(G10<0,$I$9+D10+H10+O10, IFERROR(IF(OR(AND((I10*24)>9,((H10+IF(N10=\"Ja\",(Q10-P10)+(S10-R10),0))*24*60)<45),AND((I10*24)>6,((H10+IF(N10=\"Ja\",(Q10-P10)+(S10-R10),0))*24*60)<30)),\"->Pause<-\",\"\"),\"\"))","v":""},{"$f":"IF(ISERROR(VLOOKUP(C10,Feiertage,2,FALSE))=TRUE,IF(G10<0,\"Uhr  mind. Arbeitszeit\",IF(AND(I10<>\" \",I10>$G$9),\"Arbeitszeit >10 Std.\",\" \")),VLOOKUP(C10,Feiertage,2,FALSE))","v":" "},{"$f":"IF(ISERROR(VLOOKUP(C10,Feiertage,2,FALSE))=TRUE,\"\",\"FT\")","v":""},null,{"$f":"IF(N10=\"Ja\",((U10-T10)+(W10-V10))-((Q10-P10)+(S10-R10)),0)","v":0},null,null,null,null,null,null,null,null,null,{"$f":"UPPER(TRIM(M10))","v":""},{"$f":"IF(AA10=\"\",\"\",MAX(Z$9:Z9)+1)","v":""},{"$f":"IF(M10=\"U\",C10,\"\")","v":""}]
["Mi",{"$f":"IF(OR(A11=\"Sa\",A11=\"So\"),\"0:00\",IF(Y11=\"FT\",\"0:00\",$I$9))","v":"06:00:00"},{"$f":"C10+1","v":"2022-09-01"},"00:00:00","00:00:00",null,{"$f":"IF(I11=\" \",0,I11 + IF(N11=\"Ja\", (U11-T11) + (W11-V11),0))","v":"00:00:00"},"00:35:00",{"$f":"IFERROR(IF(E11=0,IF(D11=0,\" \",E11-D11+F11-H11),TIME(HOUR(E11-D11+F11),MINUTE(E11-D11+F11),0)-H11) - IF(N11=\"Ja\",(Q11-P11) + (S11-R11),0),\" \")","v":" "},{"$f":"IF(Y11=\"GT\",-B11,IF(E11>0,G11-B11,IF(F11>0,G11-B11,\"     ---   \")))","v":"     ---   "},{"$f":"IF(G11<0,$I$9+D11+H11+O11, IFERROR(IF(OR(AND((I11*24)>9,((H11+IF(N11=\"Ja\",(Q11-P11)+(S11-R11),0))*24*60)<45),AND((I11*24)>6,((H11+IF(N11=\"Ja\",(Q11-P11)+(S11-R11),0))*24*60)<30)),\"->Pause<-\",\"\"),\"\"))","v":""}," ","",null,{"$f":"IF(N11=\"Ja\",((U11-T11)+(W11-V11))-((Q11-P11)+(S11-R11)),0)","v":0},null,null,null,null,null,null,null,null,null,"",{"$f":"IF(AA11=\"\",\"\",MAX(Z$9:Z10)+1)","v":""},{"$f":"IF(M11=\"U\",C11,\"\")","v":""}]
["Do","06:00:00","2022-09-02","00:00:00","00:00:00",null,"00:00:00","00:35:00"," ","     ---   ",""," ","",null,0,null,null,null,null,null,null,null,null,null,"",{"$f":"IF(AA12=\"\",\"\",MAX(Z$9:Z11)+1)","v":""},""]
["Fr","06:00:00","2022-09-03","00:00:00","00:00:00",null,"00:00:00","00:35:00"," ","     ---   ",""," ","",null,0,null,null,null,null,null,null,null,null,null,"",{"$f":"IF(AA13=\"\",\"\",MAX(Z$9:Z12)+1)","v":""},""]
["Sa","0:00","2022-09-04","00:00:00","00:00:00",null,"00:00:00","00:35:00"," ","     ---   ",""," ","",null,0,null,null,null,null,null,null,null,null,null,"",{"$f":"IF(AA14=\"\",\"\",MAX(Z$9:Z13)+1)","v":""},""]
["So","0:00","2022-09-05","00:00:00","00:00:00",null,"00:00:00","00:35:00"," ","     ---   ",""," ","",null,0,null,null,null,null,null,null,null,null,null,"",{"$f":"IF(AA15=\"\",\"\",MAX(Z$9:Z14)+1)","v":""},""]
["Mo","06:00:00","2022-09-06","00:00:00","00:00:00",null,"00:00:00","00:35:00"," ","     ---   ",""," ","",null,0,null,null,null,null,null,null,null,null,null,"",{"$f":"IF(AA16=\"\",\"\",MAX(Z$9:Z15)+1)","v":""},""]
["Di","06:00:00","2022-09-07","00:00:00","00:00:00",null,"00:00:00","00:35:00"," ","     ---   ",""," ","",null,0,null,null,null,null,null,null,null,null,null,"",{"$f":"IF(AA17=\"\",\"\",MAX(Z$9:Z16)+1)","v":""},""]
["Mi","06:00:00","2022-09-08","00:00:00","00:00:00",null,"00:00:00","00:35:00"," ","     ---   ",""," ","",null,0,null,null,null,null,null,null,null,null,null,"",{"$f":"IF(AA18=\"\",\"\",MAX(Z$9:Z17)+1)","v":""},""]
["Do","06:00:00","2022-09-09","00:00:00","00:00:00",null,"00:00:00","00:35:00"," ","     ---   ",""," ",null,null,0,null,null,null,null,null,null,null,null,null,"",{"$f":"IF(AA19=\"\",\"\",MAX(Z$9:Z18)+1)","v":""},""]
["Fr","06:00:00","2022-09-10","00:00:00","00:00:00",null,"00:00:00","00:35:00"," ","     ---   ",""," ","",null,0,null,null,null,null,null,null,null,null,null,"",{"$f":"IF(AA20=\"\",\"\",MAX(Z$9:Z19)+1)","v":""},""]
["Sa","0:00","2022-09-11","00:00:00","00:00:00",null,"00:00:00","00:35:00"," ","     ---   ",""," ","",null,0,null,null,null,null,null,null,null,null,null,"",{"$f":"IF(AA21=\"\",\"\",MAX(Z$9:Z20)+1)","v":""},""]
["So","0:00","2022-09-12","00:00:00","00:00:00",null,"00:00:00","00:35:00"," ","     ---   ",""," ",null,null,0,null,null,null,null,null,null,null,null,null,"",{"$f":"IF(AA22=\"\",\"\",MAX(Z$9:Z21)+1)","v":""},""]
["Mo","06:00:00","2022-09-13","00:00:00","00:00:00",null,"00:00:00","00:35:00"," ","     ---   ",""," ","",null,0,null,null,null,null,null,null,null,null,null,"",{"$f":"IF(AA23=\"\",\"\",MAX(Z$9:Z22)+1)","v":""},""]
["Di","06:00:00","2022-09-14","00:00:00","00:00:00",null,"00:00:00","00:35:00"," ","     ---   ",""," ","",null,0,null,null,null,null,null,null,null,null,null,"",{"$f":"IF(AA24=\"\",\"\",MAX(Z$9:Z23)+1)","v":""},""]
["Mi","06:00:00","2022-09-15","00:00:00","00:00:00",null,"00:00:00","00:35:00"," ","     ---   ",""," ","",null,0,null,null,null,null,null,null,null,null,null,"",{"$f":"IF(AA25=\"\",\"\",MAX(Z$9:Z24)+1)","v":""},""]
["Do","06:00:00","2022-09-16","00:00:00","00:00:00",null,"00:00:00","00:35:00"," ","     ---   ",""," ","",null,0,null,null,null,null,null,null,null,null,null,"",{"$f":"IF(AA26=\"\",\"\",MAX(Z$9:Z25)+1)","v":""},""]
["Fr","06:00:00","2022-09-17","00:00:00","00:00:00",null,"00:00:00","00:35:00"," ","     ---   ",""," ","",null,0,null,null,null,null,null,null,null,null,null,"",{"$f":"IF(AA27=\"\",\"\",MAX(Z$9:Z26)+1)","v":""},""]
["Sa","0:00","2022-09-18","00:00:00","00:00:00",null,"00:00:00","00:35:00"," ","     ---   ",""," ","",null,0,null,null,null,null,null,null,null,null,null,"",{"$f":"IF(AA28=\"\",\"\",MAX(Z$9:Z27)+1)","v":""},""]
["So","0:00","2022-09-19","00:00:00","00:00:00",null,"00:00:00","00:35:00"," ","     ---   ",""," ","",null,0,null,null,null,null,null,null,null,null,null,"",{"$f":"IF(AA29=\"\",\"\",MAX(Z$9:Z28)+1)","v":""},""]
["Mo","06:00:00","2022-09-20","00:00:00","00:00:00",null,"00:00:00","00:35:00"," ","     ---   ",""," ","",null,0,null,null,null,null,null,null,null,null,null,"",{"$f":"IF(AA30=\"\",\"\",MAX(Z$9:Z29)+1)","v":""},""]
["Di","06:00:00","2022-09-21","00:00:00","00:00:00",null,"00:00:00","00:35:00"," ","     ---   ",""," ","",null,0,null,null,null,null,null,null,null,null,null,"",{"$f":"IF(AA31=\"\",\"\",MAX(Z$9:Z30)+1)","v":""},""]
["Mi","06:00:00","2022-09-22","00:00:00","00:00:00",null,"00:00:00","00:35:00"," ","     ---   ",""," ","",null,0,null,null,null,null,null,null,null,null,null,"",{"$f":"IF(AA32=\"\",\"\",MAX(Z$9:Z31)+1)","v":""},""]
["Do","06:00:00","2022-09-23","00:00:00","00:00:00",null,"00:00:00","00:35:00"," ","     ---   ",""," ","",null,0,null,null,null,null,null,null,null,null,null,"",{"$f":"IF(AA33=\"\",\"\",MAX(Z$9:Z32)+1)","v":""},""]
["Fr","06:00:00","2022-09-24","00:00:00","00:00:00",null,"00:00:00","00:35:00"," ","     ---   ",""," ","",null,0,null,null,null,null,null,null,null,null,null,"",{"$f":"IF(AA34=\"\",\"\",MAX(Z$9:Z33)+1)","v":""},""]
["Sa","0:00","2022-09-25","00:00:00","00:00:00",null,"00:00:00","00:35:00"," ","     ---   ",""," ","",null,0,null,null,null,null,null,null,null,null,null,"",{"$f":"IF(AA35=\"\",\"\",MAX(Z$9:Z34)+1)","v":""},""]
["So","0:00","2022-09-26","00:00:00","00:00:00",null,"00:00:00","00:35:00"," ","     ---   ",""," ","",null,0,null,null,null,null,null,null,null,null,null,"",{"$f":"IF(AA36=\"\",\"\",MAX(Z$9:Z35)+1)","v":""},""]
["Mo","06:00:00","2022-09-27","00:00:00","00:00:00",null,"00:00:00","00:35:00"," ","     ---   ",""," ","",null,0,null,null,null,null,null,null,null,null,null,"",{"$f":"IF(AA37=\"\",\"\",MAX(Z$9:Z36)+1)","v":""},""]
["Di","06:00:00","2022-09-28","00:00:00","00:00:00",null,"00:00:00","00:35:00"," ","     ---   ",""," ","",null,0,null,null,null,null,null,null,null,null,null,"",{"$f":"IF(AA38=\"\",\"\",MAX(Z$9:Z37)+1)","v":""},""]
["Mi","06:00:00","2022-09-29","00:00:00","00:00:00",null,"00:00:00","00:35:00"," ","     ---   ",""," ","",null,0,null,null,null,null,null,null,null,null,null,"",{"$f":"IF(AA39=\"\",\"\",MAX(Z$9:Z38)+1)","v":""},""]
[null,null,null,null,null,null,null,null,null,null,{"$f":"IF(G40<0,$I$9+D40+H40+O40, IFERROR(IF(OR(AND((I40*24)>=9,((H40+O40)*24*60)<45),AND((I40*24)>=6,((H40+O40)*24*60)<30)),\"->Pause<-\",\"\"),\"\"))","v":""}," "]
[null,null,null,null,null,null,null,null,null,{"$f":"SUM(J10:J39)","v":0},"Mon.saldo",{"$f":"J41","v":0},null,null,null,null,null,null,null,null,null,null,null,null,null,{"$f":"IF(AA41=\"\",\"\",MAX(Z$9:Z39)+1)","v":""},""]
[null,null,null,null,null,null,null,null,null,"+ Saldo / Vormonate",null,{"$f":"August!L44","v":-0.19097222222222227},{"$f":"VLOOKUP($J$4,Tabelle_Kürzel_Abwesenheit,Spalte_GT_Monat,FALSE)","v":0},"Ganztäg. Zeitentnahmen lfd. Monat",null,{"$f":"VLOOKUP($J$4,Tabelle_Kürzel_Abwesenheit,Spalte_U_Monat,FALSE)","v":0},"Urlaub lfd. Monat",{"$f":"VLOOKUP($J$4,Tabelle_Kürzel_Abwesenheit,Spalte_K_Monat,FALSE)","v":0},"krank lfd. Monat",null,null,null,null,null,null,{"$f":"MAX(Z9:Z41)","v":0},{"$f":"COUNT(AA10:AA41)","v":0}]
[null,null,null,null,null,null,null,null,null,"- Auszahlungen",null,0,{"$f":"VLOOKUP($J$4,Tabelle_Kürzel_Abwesenheit,Spalte_GT_Summe,FALSE)","v":0},"Ganztäg. Zeitentnahmen Jahr",null,{"$f":"VLOOKUP($J$4,Tabelle_Kürzel_Abwesenheit,Spalte_U_Summe,FALSE)","v":0},"Urlaub Jahr",{"$f":"VLOOKUP($J$4,Tabelle_Kürzel_Abwesenheit,Spalte_K_Summe,FALSE)","v":0},"krank Jahr"]
[null,null,null,null,null,null,null,null,null,"Gesamtsaldo",null,{"$f":"SUM(L41:L42)-L43","v":-0.19097222222222227}]
[]
[]
[null,null,"Vorgesetzten-",null,{"$f":"E4","v":"2021-12-31"},null,null,null,{"$f":"I4","v":"Monat:"},null,null,null,null,{"$f":"M4","v":"Vertragliche regelmäßige Wochenarbeitszeit: "},{"$f":"Y5","v":30},{"$f":"P5","v":"Std/Woche"}]
[null,null,"Meldung",null,null,null,null,null,null,{"$f":"J4","v":"September"}]
[null,null,{"$f":"C6","v":"Name:"},{"$f":"D6","v":0},null,null,{"$f":"G6","v":"Vorname:"},{"$f":"H6","v":0},null,null,null,null,{"$f":"M6","v":0}]
[null,null,null,null,null,null,null,null,null,{"$f":"J6","v":"Pers.-Nr.:"},{"$f":"K6","v":0},"Abteilung/Kostenstelle:",null,"Bemerkungen"]
[null,null,{"$f":"C8","v":"Datum"},"Kommen","Gehen","Anwesenh.",{"$f":"G8","v":"Gesamtzeit"},"Mittag","Arbeitszeit",{"$f":"J8","v":"Stunden"},"Bemerkungen"]
[null,null,"Tag","08:00:00","14:35:00","abs. u. TZ","10:00:00","00:35:00","06:00:00",{"$f":"J9","v":"Saldo"},null,"Hinweise",{"$f":"M9","v":"FT/U/GT/SD/K"}]
[{"$f":"A10","v":"Di"},"06:00:00","2022-08-31",{"$f":"IF(D10=0,\" \",IF(OR($A53=\"Sa\",$A53=\"So\",$M53=\"FT\"),D10,IF(D10<$D$84,D10,\" \")))","v":" "},{"$f":"IF(E10=0,\" \",IF(OR($A53=\"Sa\",$A53=\"So\",$M53=\"FT\"),E10,IF(E10>$D$85,E10,\" \")))","v":" "},null,{"$f":"IF(G10=0,\" \",IF(G10-H10-O10>$H$85,G10,\" \"))","v":" "},{"$f":"IF(K10=\"->Pause<-\",\"Pause!\",\"\")","v":""},null,null,{"$f":"IF(G53<>\" \",\"AZ > 10 h\",\" \")","v":" "},{"$f":"IF(ISERROR(VLOOKUP(C53,Feiertage,2,FALSE))=TRUE,IF(E53<>\" \",\"Kommen/Gehen vor/nach 06:30/20:00\",IF(D53<>\" \",\"Kommen/Gehen vor/nach 06:30/20:00\",\" \")),VLOOKUP(C53,Feiertage,2,FALSE))","v":" "},{"$f":"IF(Y10>0,Y10,\" \")","v":""},null,null,null,null,null,null,null,null,null,null,null,{"$f":"Y10","v":""}]
["Mi","06:00:00","2022-09-01"," "," ",null," ",{"$f":"IF(K11=\"->Pause<-\",\"Pause!\",\"\")","v":""},null,null," "," ",{"$f":"IF(Y11>0,Y11,\" \")","v":""},null,null,null,null,null,null,null,null,null,null,null,""]
["Do","06:00:00","2022-09-02"," "," ",null," ","",null,null," "," ","",null,null,null,null,null,null,null,null,null,null,null,""]
["Fr","06:00:00","2022-09-03"," "," ",null," ","",null,null," "," ","",null,null,null,null,null,null,null,null,null,null,null,""]
["Sa","0:00","2022-09-04"," "," ",null," ","",null,null," "," ","",null,null,null,null,null,null,null,null,null,null,null,""]
["So","0:00","2022-09-05"," "," ",null," ","",null,null," "," ","",null,null,null,null,null,null,null,null,null,null,null,""]
["Mo","06:00:00","2022-09-06"," "," ",null," ","",null,null," "," ","",null,null,null,null,null,null,null,null,null,null,null,""]
["Di","06:00:00","2022-09-07"," "," ",null," ","",null,null," "," ","",null,null,null,null,null,null,null,null,null,null,null,""]
["Mi","06:00:00","2022-09-08"," "," ",null," ","",null,null," "," ","",null,null,null,null,null,null,null,null,null,null,null,""]
["Do","06:00:00","2022-09-09"," "," ",null," ","",null,null," "," ","",null,null,null,null,null,null,null,null,null,null,null,""]
["Fr","06:00:00","2022-09-10"," "," ",null," ","",null,null," "," ","",null,null,null,null,null,null,null,null,null,null,null,""]
["Sa","0:00","2022-09-11"," "," ",null," ","",null,null," "," ","",null,null,null,null,null,null,null,null,null,null,null,""]
["So","0:00","2022-09-12"," "," ",null," ","",null,null," "," ","",null,null,null,null,null,null,null,null,null,null,null,""]
["Mo","06:00:00","2022-09-13"," "," ",null," ","",null,null," "," ","",null,null,null,null,null,null,null,null,null,null,null,""]
["Di","06:00:00","2022-09-14"," "," ",null," ","",null,null," "," ","",null,null,null,null,null,null,null,null,null,null,null,""]
["Mi","06:00:00","2022-09-15"," "," ",null," ","",null,null," "," ","",null,null,null,null,null,null,null,null,null,null,null,""]
["Do","06:00:00","2022-09-16"," "," ",null," ","",null,null," "," ","",null,null,null,null,null,null,null,null,null,null,null,""]
["Fr","06:00:00","2022-09-17"," "," ",null," ","",null,null," "," ","",null,null,null,null,null,null,null,null,null,null,null,""]
["Sa","0:00","2022-09-18"," "," ",null," ","",null,null," "," ","",null,null,null,null,null,null,null,null,null,null,null,""]
["So","0:00","2022-09-19"," "," ",null," ","",null,null," "," ","",null,null,null,null,null,null,null,null,null,null,null,""]
["Mo","06:00:00","2022-09-20"," "," ",null," ","",null,null," "," ","",null,null,null,null,null,null,null,null,null,null,null,""]
["Di","06:00:00","2022-09-21"," "," ",null," ","",null,null," "," ","",null,null,null,null,null,null,null,null,null,null,null,""]
["Mi","06:00:00","2022-09-22"," "," ",null," ","",null,null," "," ","",null,null,null,null,null,null,null,null,null,null,null,""]
["Do","06:00:00","2022-09-23"," "," ",null," ","",null,null," "," ","",null,null,null,null,null,null,null,null,null,null,null,""]
["Fr","06:00:00","2022-09-24"," "," ",null," ","",null,null," "," ","",null,null,null,null,null,null,null,null,null,null,null,""]
["Sa","0:00","2022-09-25"," "," ",null," ","",null,null," "," ","",null,null,null,null,null,null,null,null,null,null,null,""]
["So","0:00","2022-09-26"," "," ",null," ","",null,null," "," ","",null,null,null,null,null,null,null,null,null,null,null,""]
["Mo","06:00:00","2022-09-27"," "," ",null," ","",null,null," "," ","",null,null,null,null,null,null,null,null,null,null,null,""]
["Di","06:00:00","2022-09-28"," "," ",null," ","",null,null," "," ","",null,null,null,null,null,null,null,null,null,null,null,""]
["Mi","06:00:00","2022-09-29"," "," ",null," ","",null,null," ",{"$f":"IF(E82<>\" \",\"Kommen/Gehen vor/nach 06:30/20:00\",IF(D82<>\" \",\"Kommen/Gehen vor/nach 06:30/20:00\",\" \"))","v":" "},"",null,null,null,null,null,null,null,null,null,null,null,""]
[null,null,"Meldegründe:",null,null,null,null,null,null,null,{"$f":"K41","v":"Mon.saldo"}]
[null,null,"vor","06:30:00",null,null,"Über 60 Stunden",{"$f":"H85*6","v":2.5},"Gesamtsaldo",{"$f":"J42","v":"+ Saldo / Vormonate"},null,null,{"$f":"M42","v":0},{"$f":"N42","v":"Ganztäg. Zeitentnahmen lfd. Monat"}]
[null,null,"nach ","20:00:00",null,null,"Über",{"$f":"G9","v":"10:00:00"},"Std. tägl.","- Auszahlungen",null,null,{"$f":"M43","v":0},{"$f":"N43","v":"Ganztäg. Zeitentnahmen Jahr"}]
[{"$f":"Januar!A87","v":"V 2026.1"},null,{"$f":"\"mobile Work / Telearbeit: \"&IF(H4=\"Ja\",'mW-HO'!AA37&\"%\",\"n.a.\")","v":"mobile Work / Telearbeit: 0%"},null,null,null,"unter -20 Stunden",{"$f":"-H85*2","v":-0.83333333333333337},"Gesamtsaldo",{"$f":"J44","v":"Gesamtsaldo"},null,{"$f":"IF(H84>L44,\" \",L44)","v":" "}]
[null,null,null,null,null,null,null,null,null,null,null,{"$f":"IF(H86>L44,L44,\" \")","v":" "}]

{"sheet":"Oktober","index":10,"n_rows":87,"n_cols":27,"rows_kept":87,"cut":false,"hidden":false,"merged":[[7,19,7,22],[7,15,7,18],[85,2,85,4],[6,11,6,13],[0,0,0,1],[1,0,1,1],[47,3,47,4],[47,7,47,8],[5,7,5,8],[5,3,5,4],[3,5,3,6]]}
[{"$f":"L44","v":-0.19097222222222227},null,"Gesamtsaldo",null,null,null,null,null,null,null,null,null,null,null,null,"Tages-","Mo",{"$f":"INDIRECT(\"'\"&$Y$2&\"'!\"&CELL(\"address\",R1))","v":0.25},null,null,null,null,null,null,"Hilfsspalte","Urlaubstage"]
[{"$f":"L41","v":0},null,"Dieser Monat",null,null,null,null,null,null,null,null,null,null,null,null,"arbeitszeit","Di",0.25,null,null,null,null,null,null,"September"]
[null,null,null,null,null,null,null,null,null,null,null,null,null,null,null,null,"Mi",0.25]
[null,null,"Anwesenheitsliste",null,{"$f":"Januar!E4","v":"2021-12-31"},"Report HO/mW Stat.:",null,"Ja","Monat:",{"$f":"VLOOKUP(MONTH(C10),Text_Monatsname,2,FALSE)","v":"Oktober"},null,null,"Vertragliche regelmäßige Wochenarbeitszeit: ","\"hh:mm\"",{"$f":"IF(INDIRECT(\"'\"&$Y$2&\"'!\"&CELL(\"address\",O4))=\"\",\"\",INDIRECT(\"'\"&$Y$2&\"'!\"&CELL(\"address\",O4)))","v":1.25},null,"Do",0.25,null,null,null,null,null,null,{"$f":"Y5*Y6","v":1.25}]
[null,null,null,null,null,null,null,null,null,null,null,null,null,"oder: Industrieminuten \"hh,<1/10 h>\"",{"$f":"IF(INDIRECT(\"'\"&$Y$2&\"'!\"&CELL(\"address\",O5))=\"\",\"\",INDIRECT(\"'\"&$Y$2&\"'!\"&CELL(\"address\",O5)))","v":""},"Std/Woche","Fr",0.25,{"$f":"SUM(R1:R7)","v":1.25},null,null,null,null,null,{"$f":"IF(O4<>\"\",IF(O5=\"\",(DAY(O4)*24-24)+HOUR(O4)+MINUTE(O4)/60,IF(O5*Y6=O4,O5,\"Fehler\")),IF(O5<>\"\",O5,\"Fehler\"))","v":30}]
[null,null,"Name:",{"$f":"INDIRECT(\"'\"&$Y$2&\"'!\"&CELL(\"address\",D6))","v":0},null,null,"Vorname:",{"$f":"INDIRECT(\"'\"&$Y$2&\"'!\"&CELL(\"address\",H6))","v":0},null,"Pers.-Nr.:",{"$f":"INDIRECT(\"'\"&$Y$2&\"'!\"&CELL(\"address\",K6))","v":0},"Abteilung/Kostenstelle:",{"$f":"INDIRECT(\"'\"&$Y$2&\"'!\"&CELL(\"address\",M6))","v":0},null,{"$f":"IF(Y5=\"Fehler\",\"nur ein Wert!\",\"\")","v":""},"Mittagspause","Sa",0,{"$f":"IF(Y4=S5,\"Saldo O.K.\",\"Saldo falsch\")","v":"Saldo O.K."},null,null,null,null,null,"01:00:00"]
[null,null,null,null,null,null,null,null,null,null,null,"Mittagspause (Ja / Nein)  ",null,null,{"$f":"INDIRECT(\"'\"&$Y$2&\"'!\"&CELL(\"address\",O7))","v":"Ja"},{"$f":"INDIRECT(\"'\"&$Y$2&\"'!\"&CELL(\"address\",P7))","v":"00:35:00"},"So",0]
[null,"Soll","Datum","Kommen","Gehen","Anwesenh.","Gesamtzeit","Mittag","Arbeitszeit","Stunden","Bemerkungen",null,"Dienstl./Sonstige Abwesenheit",null,null,"Dokumentation sonstige Abwesenheit",null,null,null,"zusätzliche Reisezeit"]
[null,"Std","Tag","08:00:00",{"$f":"D9+I9+H9","v":"14:35:00"},"abs. u. TZ","10:00:00",{"$f":"IF(O7=\"NEIN\",0,P7)","v":"00:35:00"},{"$f":"Y4/5","v":"06:00:00"},"Saldo",null,"Hinweise","FT/U/GT/SD/K","SAR","Korrektur","von","bis","von","bis","von","bis","von","bis",null,null,{"$f":"VLOOKUP(J4,Werte_UrlaubstageProMonat,2,FALSE)","v":0}]
[{"$f":"VLOOKUP(WEEKDAY(C10,2),Text_Wochentag,2)","v":"Do"},{"$f":"IF(OR(A10=\"Sa\",A10=\"So\"),\"0:00\",IF(Y10=\"FT\",\"0:00\",$I$9))","v":"06:00:00"},{"$f":"September!C39+1","v":"2022-09-30"},"00:00:00","00:00:00",null,{"$f":"IF(I10=\" \",0,I10 + IF(N10=\"Ja\", (U10-T10) + (W10-V10),0))","v":"00:00:00"},{"$f":"$H$9","v":"00:35:00"},{"$f":"IFERROR(IF(E10=0,IF(D10=0,\" \",E10-D10+F10-H10),TIME(HOUR(E10-D10+F10),MINUTE(E10-D10+F10),0)-H10) - IF(N10=\"Ja\",(Q10-P10) + (S10-R10),0),\" \")","v":" "},{"$f":"IF(Y10=\"GT\",-B10,IF(E10>0,G10-B10,IF(F10>0,G10-B10,\"     ---   \")))","v":"     ---   "},{"$f":"IF(G10<0,$I$9+D10+H10+O10, IFERROR(IF(OR(AND((I10*24)>9,((H10+IF(N10=\"Ja\",(Q10-P10)+(S10-R10),0))*24*60)<45),AND((I10*24)>6,((H10+IF(N10=\"Ja\",(Q10-P10)+(S10-R10),0))*24*60)<30)),\"->Pause<-\",\"\"),\"\"))","v":""},{"$f":"IF(ISERROR(VLOOKUP(C10,Feiertage,2,FALSE))=TRUE,IF(G10<0,\"Uhr  mind. Arbeitszeit\",IF(AND(I10<>\" \",I10>$G$9),\"Arbeitszeit >10 Std.\",\" \")),VLOOKUP(C10,Feiertage,2,FALSE))","v":" "},{"$f":"IF(ISERROR(VLOOKUP(C10,Feiertage,2,FALSE))=TRUE,\"\",\"FT\")","v":""},null,{"$f":"IF(N10=\"Ja\",((U10-T10)+(W10-V10))-((Q10-P10)+(S10-R10)),0)","v":0},null,null,null,null,null,null,null,null,null,{"$f":"UPPER(TRIM(M10))","v":""},{"$f":"IF(AA10=\"\",\"\",MAX(Z$9:Z9)+1)","v":""},{"$f":"IF(M10=\"U\",C10,\"\")","v":""}]
["Fr",{"$f":"IF(OR(A11=\"Sa\",A11=\"So\"),\"0:00\",IF(Y11=\"FT\",\"0:00\",$I$9))","v":"06:00:00"},{"$f":"C10+1","v":"2022-10-01"},"00:00:00","00:00:00",null,{"$f":"IF(I11=\" \",0,I11 + IF(N11=\"Ja\", (U11-T11) + (W11-V11),0))","v":"00:00:00"},"00:35:00",{"$f":"IFERROR(IF(E11=0,IF(D11=0,\" \",E11-D11+F11-H11),TIME(HOUR(E11-D11+F11),MINUTE(E11-D11+F11),0)-H11) - IF(N11=\"Ja\",(Q11-P11) + (S11-R11),0),\" \")","v":" "},{"$f":"IF(Y11=\"GT\",-B11,IF(E11>0,G11-B11,IF(F11>0,G11-B11,\"     ---   \")))","v":"     ---   "},{"$f":"IF(G11<0,$I$9+D11+H11+O11, IFERROR(IF(OR(AND((I11*24)>9,((H11+IF(N11=\"Ja\",(Q11-P11)+(S11-R11),0))*24*60)<45),AND((I11*24)>6,((H11+IF(N11=\"Ja\",(Q11-P11)+(S11-R11),0))*24*60)<30)),\"->Pause<-\",\"\"),\"\"))","v":""}," ","",null,{"$f":"IF(N11=\"Ja\",((U11-T11)+(W11-V11))-((Q11-P11)+(S11-R11)),0)","v":0},null,null,null,null,null,null,null,null,null,"",{"$f":"IF(AA11=\"\",\"\",MAX(Z$9:Z10)+1)","v":""},{"$f":"IF(M11=\"U\",C11,\"\")","v":""}]
["Sa","0:00","2022-10-02","00:00:00","00:00:00",null,"00:00:00","00:35:00"," ","     ---   ","","Tag der Deutschen Einheit","FT",null,0,null,null,null,null,null,null,null,null,null,"FT",{"$f":"IF(AA12=\"\",\"\",MAX(Z$9:Z11)+1)","v":""},""]
["So","0:00","2022-10-03","00:00:00","00:00:00",null,"00:00:00","00:35:00"," ","     ---   ",""," ","",null,0,null,null,null,null,null,null,null,null,null,"",{"$f":"IF(AA13=\"\",\"\",MAX(Z$9:Z12)+1)","v":""},""]
["Mo","06:00:00","2022-10-04","00:00:00","00:00:00",null,"00:00:00","00:35:00"," ","     ---   ",""," ","",null,0,null,null,null,null,null,null,null,null,null,"",{"$f":"IF(AA14=\"\",\"\",MAX(Z$9:Z13)+1)","v":""},""]
["Di","06:00:00","2022-10-05","00:00:00","00:00:00",null,"00:00:00","00:35:00"," ","     ---   ",""," ","",null,0,null,null,null,null,null,null,null,null,null,"",{"$f":"IF(AA15=\"\",\"\",MAX(Z$9:Z14)+1)","v":""},""]
["Mi","06:00:00","2022-10-06","00:00:00","00:00:00",null,"00:00:00","00:35:00"," ","     ---   ",""," ","",null,0,null,null,null,null,null,null,null,null,null,"",{"$f":"IF(AA16=\"\",\"\",MAX(Z$9:Z15)+1)","v":""},""]
["Do","06:00:00","2022-10-07","00:00:00","00:00:00",null,"00:00:00","00:35:00"," ","     ---   ",""," ","",null,0,null,null,null,null,null,null,null,null,null,"",{"$f":"IF(AA17=\"\",\"\",MAX(Z$9:Z16)+1)","v":""},""]
["Fr","06:00:00","2022-10-08","00:00:00","00:00:00",null,"00:00:00","00:35:00"," ","     ---   ",""," ","",null,0,null,null,null,null,null,null,null,null,null,"",{"$f":"IF(AA18=\"\",\"\",MAX(Z$9:Z17)+1)","v":""},""]
["Sa","0:00","2022-10-09","00:00:00","00:00:00",null,"00:00:00","00:35:00"," ","     ---   ",""," ","",null,0,null,null,null,null,null,null,null,null,null,"",{"$f":"IF(AA19=\"\",\"\",MAX(Z$9:Z18)+1)","v":""},""]
["So","0:00","2022-10-10","00:00:00","00:00:00",null,"00:00:00","00:35:00"," ","     ---   ",""," ","",null,0,null,null,null,null,null,null,null,null,null,"",{"$f":"IF(AA20=\"\",\"\",MAX(Z$9:Z19)+1)","v":""},""]
["Mo","06:00:00","2022-10-11","00:00:00","00:00:00",null,"00:00:00","00:35:00"," ","     ---   ",""," ","",null,0,null,null,null,null,null,null,null,null,null,"",{"$f":"IF(AA21=\"\",\"\",MAX(Z$9:Z20)+1)","v":""},""]
["Di","06:00:00","2022-10-12","00:00:00","00:00:00",null,"00:00:00","00:35:00"," ","     ---   ",""," ","",null,0,null,null,null,null,null,null,null,null,null,"",{"$f":"IF(AA22=\"\",\"\",MAX(Z$9:Z21)+1)","v":""},""]
["Mi","06:00:00","2022-10-13","00:00:00","00:00:00",null,"00:00:00","00:35:00"," ","     ---   ",""," ","",null,0,null,null,null,null,null,null,null,null,null,"",{"$f":"IF(AA23=\"\",\"\",MAX(Z$9:Z22)+1)","v":""},""]
["Do","06:00:00","2022-10-14","00:00:00","00:00:00",null,"00:00:00","00:35:00"," ","     ---   ",""," ","",null,0,null,null,null,null,null,null,null,null,null,"",{"$f":"IF(AA24=\"\",\"\",MAX(Z$9:Z23)+1)","v":""},""]
["Fr","06:00:00","2022-10-15","00:00:00","00:00:00",null,"00:00:00","00:35:00"," ","     ---   ",""," ",null,null,0,null,null,null,null,null,null,null,null,null,"",{"$f":"IF(AA25=\"\",\"\",MAX(Z$9:Z24)+1)","v":""},""]
["Sa","0:00","2022-10-16","00:00:00","00:00:00",null,"00:00:00","00:35:00"," ","     ---   ",""," ",null,null,0,null,null,null,null,null,null,null,null,null,"",{"$f":"IF(AA26=\"\",\"\",MAX(Z$9:Z25)+1)","v":""},""]
["So","0:00","2022-10-17","00:00:00","00:00:00",null,"00:00:00","00:35:00"," ","     ---   ",""," ","",null,0,null,null,null,null,null,null,null,null,null,"",{"$f":"IF(AA27=\"\",\"\",MAX(Z$9:Z26)+1)","v":""},""]
["Mo","06:00:00","2022-10-18","00:00:00","00:00:00",null,"00:00:00","00:35:00"," ","     ---   ",""," ","",null,0,null,null,null,null,null,null,null,null,null,"",{"$f":"IF(AA28=\"\",\"\",MAX(Z$9:Z27)+1)","v":""},""]
["Di","06:00:00","2022-10-19","00:00:00","00:00:00",null,"00:00:00","00:35:00"," ","     ---   ",""," ","",null,0,null,null,null,null,null,null,null,null,null,"",{"$f":"IF(AA29=\"\",\"\",MAX(Z$9:Z28)+1)","v":""},""]
["Mi","06:00:00","2022-10-20","00:00:00","00:00:00",null,"00:00:00","00:35:00"," ","     ---   ",""," ","",null,0,null,null,null,null,null,null,null,null,null,"",{"$f":"IF(AA30=\"\",\"\",MAX(Z$9:Z29)+1)","v":""},""]
["Do","06:00:00","2022-10-21","00:00:00","00:00:00",null,"00:00:00","00:35:00"," ","     ---   ",""," ","",null,0,null,null,null,null,null,null,null,null,null,"",{"$f":"IF(AA31=\"\",\"\",MAX(Z$9:Z30)+1)","v":""},""]
["Fr","06:00:00","2022-10-22","00:00:00","00:00:00",null,"00:00:00","00:35:00"," ","     ---   ",""," ","",null,0,null,null,null,null,null,null,null,null,null,"",{"$f":"IF(AA32=\"\",\"\",MAX(Z$9:Z31)+1)","v":""},""]
["Sa","0:00","2022-10-23","00:00:00","00:00:00",null,"00:00:00","00:35:00"," ","     ---   ",""," ","",null,0,null,null,null,null,null,null,null,null,null,"",{"$f":"IF(AA33=\"\",\"\",MAX(Z$9:Z32)+1)","v":""},""]
["So","0:00","2022-10-24","00:00:00","00:00:00",null,"00:00:00","00:35:00"," ","     ---   ",""," ","",null,0,null,null,null,null,null,null,null,null,null,"",{"$f":"IF(AA34=\"\",\"\",MAX(Z$9:Z33)+1)","v":""},""]
["Mo","06:00:00","2022-10-25","00:00:00","00:00:00",null,"00:00:00","00:35:00"," ","     ---   ",""," ","",null,0,null,null,null,null,null,null,null,null,null,"",{"$f":"IF(AA35=\"\",\"\",MAX(Z$9:Z34)+1)","v":""},""]
["Di","06:00:00","2022-10-26","00:00:00","00:00:00",null,"00:00:00","00:35:00"," ","     ---   ",""," ","",null,0,null,null,null,null,null,null,null,null,null,"",{"$f":"IF(AA36=\"\",\"\",MAX(Z$9:Z35)+1)","v":""},""]
["Mi","06:00:00","2022-10-27","00:00:00","00:00:00",null,"00:00:00","00:35:00"," ","     ---   ",""," ","",null,0,null,null,null,null,null,null,null,null,null,"",{"$f":"IF(AA37=\"\",\"\",MAX(Z$9:Z36)+1)","v":""},""]
["Do","06:00:00","2022-10-28","00:00:00","00:00:00",null,"00:00:00","00:35:00"," ","     ---   ",""," ","",null,0,null,null,null,null,null,null,null,null,null,"",{"$f":"IF(AA38=\"\",\"\",MAX(Z$9:Z37)+1)","v":""},""]
["Fr","06:00:00","2022-10-29","00:00:00","00:00:00",null,"00:00:00","00:35:00"," ","     ---   ",""," ","",null,0,null,null,null,null,null,null,null,null,null,"",{"$f":"IF(AA39=\"\",\"\",MAX(Z$9:Z38)+1)","v":""},""]
["Sa","0:00","2022-10-30","00:00:00","00:00:00",null,"00:00:00","00:35:00"," ","     ---   ",""," ","",null,0,null,null,null,null,null,null,null,null,null,"",{"$f":"IF(AA40=\"\",\"\",MAX(Z$9:Z39)+1)","v":""},""]
[null,null,null,null,null,null,null,null,null,{"$f":"SUM(J10:J40)","v":0},"Mon.saldo",{"$f":"J41","v":0},null,null,null,null,null,null,null,null,null,null,null,null,null,{"$f":"MAX(Z9:Z40)","v":0},{"$f":"COUNT(AA10:AA40)","v":0}]
[null,null,null,null,null,null,null,null,null,"+ Saldo / Vormonate",null,{"$f":"September!L44","v":-0.19097222222222227},{"$f":"VLOOKUP($J$4,Tabelle_Kürzel_Abwesenheit,Spalte_GT_Monat,FALSE)","v":0},"Ganztäg. Zeitentnahmen lfd. Monat",null,{"$f":"VLOOKUP($J$4,Tabelle_Kürzel_Abwesenheit,Spalte_U_Monat,FALSE)","v":0},"Urlaub lfd. Monat",{"$f":"VLOOKUP($J$4,Tabelle_Kürzel_Abwesenheit,Spalte_K_Monat,FALSE)","v":0},"krank lfd. Monat"]
[null,null,null,null,null,null,null,null,null,"- Auszahlungen",null,0,{"$f":"VLOOKUP($J$4,Tabelle_Kürzel_Abwesenheit,Spalte_GT_Summe,FALSE)","v":0},"Ganztäg. Zeitentnahmen Jahr",null,{"$f":"VLOOKUP($J$4,Tabelle_Kürzel_Abwesenheit,Spalte_U_Summe,FALSE)","v":0},"Urlaub Jahr",{"$f":"VLOOKUP($J$4,Tabelle_Kürzel_Abwesenheit,Spalte_K_Summe,FALSE)","v":0},"krank Jahr"]
[null,null,null,null,null,null,null,null,null,"Gesamtsaldo",null,{"$f":"SUM(L41:L42)-L43","v":-0.19097222222222227}]
[]
[null,null,"Vorgesetzten-",null,{"$f":"E4","v":"2021-12-31"},null,null,null,{"$f":"I4","v":"Monat:"},null,null,null,null,{"$f":"M4","v":"Vertragliche regelmäßige Wochenarbeitszeit: "},{"$f":"Y5","v":30},{"$f":"P5","v":"Std/Woche"}]
[null,null,"Meldung",null,null,null,null,null,null,{"$f":"J4","v":"Oktober"}]
[null,null,{"$f":"C6","v":"Name:"},{"$f":"D6","v":0},null,null,{"$f":"G6","v":"Vorname:"},{"$f":"H6","v":0},null,null,null,null,{"$f":"M6","v":0}]
[null,null,null,null,null,null,null,null,null,{"$f":"J6","v":"Pers.-Nr.:"},{"$f":"K6","v":0},"Abteilung/Kostenstelle:",null,"Bemerkungen"]
[null,null,{"$f":"C8","v":"Datum"},"Kommen","Gehen","Anwesenh.",{"$f":"G8","v":"Gesamtzeit"},"Mittag","Arbeitszeit",{"$f":"J8","v":"Stunden"},"Bemerkungen"]
[null,null,"Tag","08:00:00","14:35:00","abs. u. TZ","10:00:00","00:35:00","06:00:00",{"$f":"J9","v":"Saldo"},null,"Hinweise",{"$f":"M9","v":"FT/U/GT/SD/K"}]
[{"$f":"A10","v":"Do"},"06:00:00","2022-09-30",{"$f":"IF(D10=0,\" \",IF(OR($A52=\"Sa\",$A52=\"So\",$M52=\"FT\"),D10,IF(D10<$D$84,D10,\" \")))","v":" "},{"$f":"IF(E10=0,\" \",IF(OR($A52=\"Sa\",$A52=\"So\",$M52=\"FT\"),E10,IF(E10>$D$85,E10,\" \")))","v":" "},null,{"$f":"IF(G10=0,\" \",IF(G10-H10-O10>$H$85,G10,\" \"))","v":" "},{"$f":"IF(K10=\"->Pause<-\",\"Pause!\",\"\")","v":""},null,null,{"$f":"IF(G52<>\" \",\"AZ > 10 h\",\" \")","v":" "},{"$f":"IF(ISERROR(VLOOKUP(C52,Feiertage,2,FALSE))=TRUE,IF(E52<>\" \",\"Kommen/Gehen vor/nach 06:30/20:00\",IF(D52<>\" \",\"Kommen/Gehen vor/nach 06:30/20:00\",\" \")),VLOOKUP(C52,Feiertage,2,FALSE))","v":" "},{"$f":"IF(Y10>0,Y10,\" \")","v":""},null,null,null,null,null,null,null,null,null,null,null,{"$f":"Y10","v":""}]
["Fr","06:00:00","2022-10-01"," "," ",null," ",{"$f":"IF(K11=\"->Pause<-\",\"Pause!\",\"\")","v":""},null,null," "," ",{"$f":"IF(Y11>0,Y11,\" \")","v":""},null,null,null,null,null,null,null,null,null,null,null,""]
["Sa","0:00","2022-10-02"," "," ",null," ","",null,null," ","Tag der Deutschen Einheit","FT",null,null,null,null,null,null,null,null,null,null,null,"FT"]
["So","0:00","2022-10-03"," "," ",null," ","",null,null," "," ","",null,null,null,null,null,null,null,null,null,null,null,""]
["Mo","06:00:00","2022-10-04"," "," ",null," ","",null,null," "," ","",null,null,null,null,null,null,null,null,null,null,null,""]
["Di","06:00:00","2022-10-05"," "," ",null," ","",null,null," "," ","",null,null,null,null,null,null,null,null,null,null,null,""]
["Mi","06:00:00","2022-10-06"," "," ",null," ","",null,null," "," ","",null,null,null,null,null,null,null,null,null,null,null,""]
["Do","06:00:00","2022-10-07"," "," ",null," ","",null,null," "," ","",null,null,null,null,null,null,null,null,null,null,null,""]
["Fr","06:00:00","2022-10-08"," "," ",null," ","",null,null," "," ","",null,null,null,null,null,null,null,null,null,null,null,""]
["Sa","0:00","2022-10-09"," "," ",null," ","",null,null," "," ","",null,null,null,null,null,null,null,null,null,null,null,""]
["So","0:00","2022-10-10"," "," ",null," ","",null,null," "," ","",null,null,null,null,null,null,null,null,null,null,null,""]
["Mo","06:00:00","2022-10-11"," "," ",null," ","",null,null," "," ","",null,null,null,null,null,null,null,null,null,null,null,""]
["Di","06:00:00","2022-10-12"," "," ",null," ","",null,null," "," ","",null,null,null,null,null,null,null,null,null,null,null,""]
["Mi","06:00:00","2022-10-13"," "," ",null," ","",null,null," "," ","",null,null,null,null,null,null,null,null,null,null,null,""]
["Do","06:00:00","2022-10-14"," "," ",null," ","",null,null," "," ","",null,null,null,null,null,null,null,null,null,null,null,""]
["Fr","06:00:00","2022-10-15"," "," ",null," ","",null,null," "," ","",null,null,null,null,null,null,null,null,null,null,null,""]
["Sa","0:00","2022-10-16"," "," ",null," ","",null,null," "," ","",null,null,null,null,null,null,null,null,null,null,null,""]
["So","0:00","2022-10-17"," "," ",null," ","",null,null," "," ","",null,null,null,null,null,null,null,null,null,null,null,""]
["Mo","06:00:00","2022-10-18"," "," ",null," ","",null,null," "," ","",null,null,null,null,null,null,null,null,null,null,null,""]
["Di","06:00:00","2022-10-19"," "," ",null," ","",null,null," "," ","",null,null,null,null,null,null,null,null,null,null,null,""]
["Mi","06:00:00","2022-10-20"," "," ",null," ","",null,null," "," ","",null,null,null,null,null,null,null,null,null,null,null,""]
["Do","06:00:00","2022-10-21"," "," ",null," ","",null,null," "," ","",null,null,null,null,null,null,null,null,null,null,null,""]
["Fr","06:00:00","2022-10-22"," "," ",null," ","",null,null," "," ","",null,null,null,null,null,null,null,null,null,null,null,""]
["Sa","0:00","2022-10-23"," "," ",null," ","",null,null," "," ","",null,null,null,null,null,null,null,null,null,null,null,""]
["So","0:00","2022-10-24"," "," ",null," ","",null,null," "," ","",null,null,null,null,null,null,null,null,null,null,null,""]
["Mo","06:00:00","2022-10-25",{"$f":"IF(D35=0,\" \",IF(OR($A77=\"Sa\",$A77=\"So\",$M77=\"FT\"),D35,IF(D35<$D$84,D35,\" \")))","v":" "},{"$f":"IF(E35=0,\" \",IF(OR($A77=\"Sa\",$A77=\"So\",$M77=\"FT\"),E35,IF(E35>$D$85,E35,\" \")))","v":" "},null,{"$f":"IF(G35=0,\" \",IF(G35-H35-O35>$H$85,G35,\" \"))","v":" "},"",null,null,{"$f":"IF(G77<>\" \",\"AZ > 10 h\",\" \")","v":" "}," ","",null,null,null,null,null,null,null,null,null,null,null,""]
["Di","06:00:00","2022-10-26"," "," ",null," ","",null,null," "," ","",null,null,null,null,null,null,null,null,null,null,null,""]
["Mi","06:00:00","2022-10-27"," "," ",null," ","",null,null," "," ","",null,null,null,null,null,null,null,null,null,null,null,""]
["Do","06:00:00","2022-10-28"," "," ",null," ","",null,null," "," ","",null,null,null,null,null,null,null,null,null,null,null,""]
["Fr","06:00:00","2022-10-29"," "," ",null," ","",null,null," "," ","",null,null,null,null,null,null,null,null,null,null,null,""]
["Sa","0:00","2022-10-30"," "," ",null," ","",null,null," "," ","",null,null,null,null,null,null,null,null,null,null,null,""]
[null,null,"Meldegründe:",null,null,null,null,null,null,null,{"$f":"K41","v":"Mon.saldo"}]
[null,null,"vor","06:30:00",null,null,"Über 60 Stunden",{"$f":"H85*6","v":2.5},"Gesamtsaldo",{"$f":"J42","v":"+ Saldo / Vormonate"},null,null,{"$f":"M42","v":0},{"$f":"N42","v":"Ganztäg. Zeitentnahmen lfd. Monat"}]
[null,null,"nach ","20:00:00",null,null,"Über",{"$f":"G9","v":"10:00:00"},"Std. tägl.","- Auszahlungen",null,{"$f":"L42","v":-0.19097222222222227},{"$f":"M43","v":0},{"$f":"N43","v":"Ganztäg. Zeitentnahmen Jahr"}]
[{"$f":"Januar!A87","v":"V 2026.1"},null,{"$f":"\"mobile Work / Telearbeit: \"&IF(H4=\"Ja\",'mW-HO'!AD37&\"%\",\"n.a.\")","v":"mobile Work / Telearbeit: 0%"},null,null,null,"unter -20 Stunden",{"$f":"-H85*2","v":-0.83333333333333337},"Gesamtsaldo",{"$f":"J44","v":"Gesamtsaldo"},null,{"$f":"IF(H84>L44,\" \",L44)","v":" "}]
[null,null,null,null,null,null,null,null,null,null,null,{"$f":"IF(H86>L44,L44,\" \")","v":" "}]

{"sheet":"November","index":11,"n_rows":87,"n_cols":27,"rows_kept":87,"cut":false,"hidden":false,"merged":[[7,19,7,22],[7,15,7,18],[85,2,85,4],[6,11,6,13],[0,0,0,1],[1,0,1,1],[48,3,48,4],[48,7,48,8],[5,7,5,8],[5,3,5,4],[3,5,3,6]]}
[{"$f":"L44","v":-0.19097222222222227},null,"Gesamtsaldo",null,null,null,null,null,null,null,null,null,null,null,null,"Tages-","Mo",{"$f":"INDIRECT(\"'\"&$Y$2&\"'!\"&CELL(\"address\",R1))","v":0.25},null,null,null,null,null,null,"Hilfsspalte","Urlaubstage"]
[{"$f":"L41","v":0},null,"Dieser Monat",null,null,null,null,null,null,null,null,null,null,null,null,"arbeitszeit","Di",0.25,null,null,null,null,null,null,"Oktober"]
[null,null,null,null,null,null,null,null,null,null,null,null,null,null,null,null,"Mi",0.25]
[null,null,"Anwesenheitsliste",null,{"$f":"Januar!E4","v":"2021-12-31"},"Report HO/mW Stat.:",null,"Ja","Monat:",{"$f":"VLOOKUP(MONTH(C10),Text_Monatsname,2,FALSE)","v":"November"},null,null,"Vertragliche regelmäßige Wochenarbeitszeit: ","\"hh:mm\"",{"$f":"IF(INDIRECT(\"'\"&$Y$2&\"'!\"&CELL(\"address\",O4))=\"\",\"\",INDIRECT(\"'\"&$Y$2&\"'!\"&CELL(\"address\",O4)))","v":1.25},null,"Do",0.25,null,null,null,null,null,null,{"$f":"Y5*Y6","v":1.25}]
[null,null,null,null,null,null,null,null,null,null,null,null,null,"oder: Industrieminuten \"hh,<1/10 h>\"",{"$f":"IF(INDIRECT(\"'\"&$Y$2&\"'!\"&CELL(\"address\",O5))=\"\",\"\",INDIRECT(\"'\"&$Y$2&\"'!\"&CELL(\"address\",O5)))","v":""},"Std/Woche","Fr",0.25,{"$f":"SUM(R1:R7)","v":1.25},null,null,null,null,null,{"$f":"IF(O4<>\"\",IF(O5=\"\",(DAY(O4)*24-24)+HOUR(O4)+MINUTE(O4)/60,IF(O5*Y6=O4,O5,\"Fehler\")),IF(O5<>\"\",O5,\"Fehler\"))","v":30}]
[null,null,"Name:",{"$f":"INDIRECT(\"'\"&$Y$2&\"'!\"&CELL(\"address\",D6))","v":0},null,null,"Vorname:",{"$f":"INDIRECT(\"'\"&$Y$2&\"'!\"&CELL(\"address\",H6))","v":0},null,"Pers.-Nr.:",{"$f":"INDIRECT(\"'\"&$Y$2&\"'!\"&CELL(\"address\",K6))","v":0},"Abteilung/Kostenstelle:",{"$f":"INDIRECT(\"'\"&$Y$2&\"'!\"&CELL(\"address\",M6))","v":0},null,{"$f":"IF(Y5=\"Fehler\",\"nur ein Wert!\",\"\")","v":""},"Mittagspause","Sa",0,{"$f":"IF(Y4=S5,\"Saldo O.K.\",\"Saldo falsch\")","v":"Saldo O.K."},null,null,null,null,null,"01:00:00"]
[null,null,null,null,null,null,null,null,null,null,null,"Mittagspause (Ja / Nein)  ",null,null,{"$f":"INDIRECT(\"'\"&$Y$2&\"'!\"&CELL(\"address\",O7))","v":"Ja"},{"$f":"INDIRECT(\"'\"&$Y$2&\"'!\"&CELL(\"address\",P7))","v":"00:35:00"},"So",0]
[null,"Soll","Datum","Kommen","Gehen","Anwesenh.","Gesamtzeit","Mittag","Arbeitszeit","Stunden","Bemerkungen",null,"Dienstl./Sonstige Abwesenheit",null,null,"Dokumentation sonstige Abwesenheit",null,null,null,"zusätzliche Reisezeit"]
[null,"Std","Tag","08:00:00",{"$f":"D9+I9+H9","v":"14:35:00"},"abs. u. TZ","10:00:00",{"$f":"IF(O7=\"NEIN\",0,P7)","v":"00:35:00"},{"$f":"Y4/5","v":"06:00:00"},"Saldo",null,"Hinweise","FT/U/GT/SD/K","SAR","Korrektur","von","bis","von","bis","von","bis","von","bis",null,null,{"$f":"VLOOKUP(J4,Werte_UrlaubstageProMonat,2,FALSE)","v":0}]
[{"$f":"VLOOKUP(WEEKDAY(C10,2),Text_Wochentag,2)","v":"So"},{"$f":"IF(OR(A10=\"Sa\",A10=\"So\"),\"0:00\",IF(Y10=\"FT\",\"0:00\",$I$9))","v":"0:00"},{"$f":"Oktober!C40+1","v":"2022-10-31"},"00:00:00","00:00:00",null,{"$f":"IF(I10=\" \",0,I10 + IF(N10=\"Ja\", (U10-T10) + (W10-V10),0))","v":"00:00:00"},{"$f":"$H$9","v":"00:35:00"},{"$f":"IFERROR(IF(E10=0,IF(D10=0,\" \",E10-D10+F10-H10),TIME(HOUR(E10-D10+F10),MINUTE(E10-D10+F10),0)-H10) - IF(N10=\"Ja\",(Q10-P10) + (S10-R10),0),\" \")","v":" "},{"$f":"IF(Y10=\"GT\",-B10,IF(E10>0,G10-B10,IF(F10>0,G10-B10,\"     ---   \")))","v":"     ---   "},{"$f":"IF(G10<0,$I$9+D10+H10+O10, IFERROR(IF(OR(AND((I10*24)>9,((H10+IF(N10=\"Ja\",(Q10-P10)+(S10-R10),0))*24*60)<45),AND((I10*24)>6,((H10+IF(N10=\"Ja\",(Q10-P10)+(S10-R10),0))*24*60)<30)),\"->Pause<-\",\"\"),\"\"))","v":""},{"$f":"IF(ISERROR(VLOOKUP(C10,Feiertage,2,FALSE))=TRUE,IF(G10<0,\"Uhr  mind. Arbeitszeit\",IF(AND(I10<>\" \",I10>$G$9),\"Arbeitszeit >10 Std.\",\" \")),VLOOKUP(C10,Feiertage,2,FALSE))","v":"Allerheiligen"},{"$f":"IF(ISERROR(VLOOKUP(C10,Feiertage,2,FALSE))=TRUE,\"\",\"FT\")","v":"FT"},null,{"$f":"IF(N10=\"Ja\",((U10-T10)+(W10-V10))-((Q10-P10)+(S10-R10)),0)","v":0},null,null,null,null,null,null,null,null,null,{"$f":"UPPER(TRIM(M10))","v":"FT"},{"$f":"IF(AA10=\"\",\"\",MAX(Z$9:Z9)+1)","v":""},{"$f":"IF(M10=\"U\",C10,\"\")","v":""}]
["Mo",{"$f":"IF(OR(A11=\"Sa\",A11=\"So\"),\"0:00\",IF(Y11=\"FT\",\"0:00\",$I$9))","v":"06:00:00"},{"$f":"C10+1","v":"2022-11-01"},"00:00:00","00:00:00",null,{"$f":"IF(I11=\" \",0,I11 + IF(N11=\"Ja\", (U11-T11) + (W11-V11),0))","v":"00:00:00"},"00:35:00",{"$f":"IFERROR(IF(E11=0,IF(D11=0,\" \",E11-D11+F11-H11),TIME(HOUR(E11-D11+F11),MINUTE(E11-D11+F11),0)-H11) - IF(N11=\"Ja\",(Q11-P11) + (S11-R11),0),\" \")","v":" "},{"$f":"IF(Y11=\"GT\",-B11,IF(E11>0,G11-B11,IF(F11>0,G11-B11,\"     ---   \")))","v":"     ---   "},{"$f":"IF(G11<0,$I$9+D11+H11+O11, IFERROR(IF(OR(AND((I11*24)>9,((H11+IF(N11=\"Ja\",(Q11-P11)+(S11-R11),0))*24*60)<45),AND((I11*24)>6,((H11+IF(N11=\"Ja\",(Q11-P11)+(S11-R11),0))*24*60)<30)),\"->Pause<-\",\"\"),\"\"))","v":""}," ","",null,{"$f":"IF(N11=\"Ja\",((U11-T11)+(W11-V11))-((Q11-P11)+(S11-R11)),0)","v":0},null,null,null,null,null,null,null,null,null,"",{"$f":"IF(AA11=\"\",\"\",MAX(Z$9:Z10)+1)","v":""},{"$f":"IF(M11=\"U\",C11,\"\")","v":""}]
["Di","06:00:00",{"$f":"C11+1","v":"2022-11-02"},"00:00:00","00:00:00",null,"00:00:00","00:35:00"," ","     ---   ",""," ","",null,0,null,null,null,null,null,null,null,null,null,"",{"$f":"IF(AA12=\"\",\"\",MAX(Z$9:Z11)+1)","v":""},""]
["Mi","06:00:00","2022-11-03","00:00:00","00:00:00",null,"00:00:00","00:35:00"," ","     ---   ",""," ","",null,0,null,null,null,null,null,null,null,null,null,"",{"$f":"IF(AA13=\"\",\"\",MAX(Z$9:Z12)+1)","v":""},""]
["Do","06:00:00","2022-11-04","00:00:00","00:00:00",null,"00:00:00","00:35:00"," ","     ---   ",""," ","",null,0,null,null,null,null,null,null,null,null,null,"",{"$f":"IF(AA14=\"\",\"\",MAX(Z$9:Z13)+1)","v":""},""]
["Fr","06:00:00","2022-11-05","00:00:00","00:00:00",null,"00:00:00","00:35:00"," ","     ---   ",""," ","",null,0,null,null,null,null,null,null,null,null,null,"",{"$f":"IF(AA15=\"\",\"\",MAX(Z$9:Z14)+1)","v":""},""]
["Sa","0:00","2022-11-06","00:00:00","00:00:00",null,"00:00:00","00:35:00"," ","     ---   ",""," ","",null,0,null,null,null,null,null,null,null,null,null,"",{"$f":"IF(AA16=\"\",\"\",MAX(Z$9:Z15)+1)","v":""},""]
["So","0:00","2022-11-07","00:00:00","00:00:00",null,"00:00:00","00:35:00"," ","     ---   ",""," ","",null,0,null,null,null,null,null,null,null,null,null,"",{"$f":"IF(AA17=\"\",\"\",MAX(Z$9:Z16)+1)","v":""},""]
["Mo","06:00:00","2022-11-08","00:00:00","00:00:00",null,"00:00:00","00:35:00"," ","     ---   ",""," ","",null,0,null,null,null,null,null,null,null,null,null,"",{"$f":"IF(AA18=\"\",\"\",MAX(Z$9:Z17)+1)","v":""},""]
["Di","06:00:00","2022-11-09","00:00:00","00:00:00",null,"00:00:00","00:35:00"," ","     ---   ",""," ","",null,0,null,null,null,null,null,null,null,null,null,"",{"$f":"IF(AA19=\"\",\"\",MAX(Z$9:Z18)+1)","v":""},""]
["Mi","06:00:00","2022-11-10","00:00:00","00:00:00",null,"00:00:00","00:35:00"," ","     ---   ",""," ","",null,0,null,null,null,null,null,null,null,null,null,"",{"$f":"IF(AA20=\"\",\"\",MAX(Z$9:Z19)+1)","v":""},""]
["Do","06:00:00","2022-11-11","00:00:00","00:00:00",null,"00:00:00","00:35:00"," ","     ---   ",""," ","",null,0,null,null,null,null,null,null,null,null,null,"",{"$f":"IF(AA21=\"\",\"\",MAX(Z$9:Z20)+1)","v":""},""]
["Fr","06:00:00","2022-11-12","00:00:00","00:00:00",null,"00:00:00","00:35:00"," ","     ---   ",""," ",null,null,0,null,null,null,null,null,null,null,null,null,"",{"$f":"IF(AA22=\"\",\"\",MAX(Z$9:Z21)+1)","v":""},""]
["Sa","0:00","2022-11-13","00:00:00","00:00:00",null,"00:00:00","00:35:00"," ","     ---   ",""," ","",null,0,null,null,null,null,null,null,null,null,null,"",{"$f":"IF(AA23=\"\",\"\",MAX(Z$9:Z22)+1)","v":""},""]
["So","0:00","2022-11-14","00:00:00","00:00:00",null,"00:00:00","00:35:00"," ","     ---   ",""," ","",null,0,null,null,null,null,null,null,null,null,null,"",{"$f":"IF(AA24=\"\",\"\",MAX(Z$9:Z23)+1)","v":""},""]
["Mo","06:00:00","2022-11-15","00:00:00","00:00:00",null,"00:00:00","00:35:00"," ","     ---   ",""," ","",null,0,null,null,null,null,null,null,null,null,null,"",{"$f":"IF(AA25=\"\",\"\",MAX(Z$9:Z24)+1)","v":""},""]
["Di","06:00:00","2022-11-16","00:00:00","00:00:00",null,"00:00:00","00:35:00"," ","     ---   ",""," ","",null,0,null,null,null,null,null,null,null,null,null,"",{"$f":"IF(AA26=\"\",\"\",MAX(Z$9:Z25)+1)","v":""},""]
["Mi","06:00:00","2022-11-17","00:00:00","00:00:00",null,"00:00:00","00:35:00"," ","     ---   ",""," ","",null,0,null,null,null,null,null,null,null,null,null,"",{"$f":"IF(AA27=\"\",\"\",MAX(Z$9:Z26)+1)","v":""},""]
["Do","06:00:00","2022-11-18","00:00:00","00:00:00",null,"00:00:00","00:35:00"," ","     ---   ",""," ","",null,0,null,null,null,null,null,null,null,null,null,"",{"$f":"IF(AA28=\"\",\"\",MAX(Z$9:Z27)+1)","v":""},""]
["Fr","06:00:00","2022-11-19","00:00:00","00:00:00",null,"00:00:00","00:35:00"," ","     ---   ",""," ","",null,0,null,null,null,null,null,null,null,null,null,"",{"$f":"IF(AA29=\"\",\"\",MAX(Z$9:Z28)+1)","v":""},""]
["Sa","0:00","2022-11-20","00:00:00","00:00:00",null,"00:00:00","00:35:00"," ","     ---   ",""," ",null,null,0,null,null,null,null,null,null,null,null,null,"",{"$f":"IF(AA30=\"\",\"\",MAX(Z$9:Z29)+1)","v":""},""]
["So","0:00","2022-11-21","00:00:00","00:00:00",null,"00:00:00","00:35:00"," ","     ---   ",""," ","",null,0,null,null,null,null,null,null,null,null,null,"",{"$f":"IF(AA31=\"\",\"\",MAX(Z$9:Z30)+1)","v":""},""]
["Mo","06:00:00","2022-11-22","00:00:00","00:00:00",null,"00:00:00","00:35:00"," ","     ---   ",""," ","",null,0,null,null,null,null,null,null,null,null,null,"",{"$f":"IF(AA32=\"\",\"\",MAX(Z$9:Z31)+1)","v":""},""]
["Di","06:00:00","2022-11-23","00:00:00","00:00:00",null,"00:00:00","00:35:00"," ","     ---   ",""," ","",null,0,null,null,null,null,null,null,null,null,null,"",{"$f":"IF(AA33=\"\",\"\",MAX(Z$9:Z32)+1)","v":""},""]
["Mi","06:00:00","2022-11-24","00:00:00","00:00:00",null,"00:00:00","00:35:00"," ","     ---   ",""," ","",null,0,null,null,null,null,null,null,null,null,null,"",{"$f":"IF(AA34=\"\",\"\",MAX(Z$9:Z33)+1)","v":""},""]
["Do","06:00:00","2022-11-25","00:00:00","00:00:00",null,"00:00:00","00:35:00"," ","     ---   ",""," ","",null,0,null,null,null,null,null,null,null,null,null,"",{"$f":"IF(AA35=\"\",\"\",MAX(Z$9:Z34)+1)","v":""},""]
["Fr","06:00:00","2022-11-26","00:00:00","00:00:00",null,"00:00:00","00:35:00"," ","     ---   ",""," ","",null,0,null,null,null,null,null,null,null,null,null,"",{"$f":"IF(AA36=\"\",\"\",MAX(Z$9:Z35)+1)","v":""},""]
["Sa","0:00","2022-11-27","00:00:00","00:00:00",null,"00:00:00","00:35:00"," ","     ---   ",""," ","",null,0,null,null,null,null,null,null,null,null,null,"",{"$f":"IF(AA37=\"\",\"\",MAX(Z$9:Z36)+1)","v":""},""]
["So","0:00","2022-11-28","00:00:00","00:00:00",null,"00:00:00","00:35:00"," ","     ---   ",""," ","",null,0,null,null,null,null,null,null,null,null,null,"",{"$f":"IF(AA38=\"\",\"\",MAX(Z$9:Z37)+1)","v":""},""]
["Mo","06:00:00","2022-11-29","00:00:00","00:00:00",null,"00:00:00","00:35:00"," ","     ---   ",""," ","",null,0,null,null,null,null,null,null,null,null,null,"",{"$f":"IF(AA39=\"\",\"\",MAX(Z$9:Z38)+1)","v":""},""]
[null,null,null,null,null,null,null,null,null,null,null,null,null,null,{"$f":"IF(N40=\"Ja\",(Q40-P40)+(S40-R40),0)","v":0}]
[null,null,null,null,null,null,null,null,null,{"$f":"SUM(J10:J39)","v":0},"Mon.saldo",{"$f":"J41","v":0},null,null,null,null,null,null,null,null,null,null,null,null,null,{"$f":"IF(AA41=\"\",\"\",MAX(Z$9:Z39)+1)","v":""},""]
[null,null,null,null,null,null,null,null,null,"+ Saldo / Vormonate",null,{"$f":"Oktober!L44","v":-0.19097222222222227},{"$f":"VLOOKUP($J$4,Tabelle_Kürzel_Abwesenheit,Spalte_GT_Monat,FALSE)","v":0},"Ganztäg. Zeitentnahmen lfd. Monat",null,{"$f":"VLOOKUP($J$4,Tabelle_Kürzel_Abwesenheit,Spalte_U_Monat,FALSE)","v":0},"Urlaub lfd. Monat",{"$f":"VLOOKUP($J$4,Tabelle_Kürzel_Abwesenheit,Spalte_K_Monat,FALSE)","v":0},"krank lfd. Monat",null,null,null,null,null,null,{"$f":"MAX(Z9:Z41)","v":0},{"$f":"COUNT(AA10:AA41)","v":0}]
[null,null,null,null,null,null,null,null,null,"- Auszahlungen",null,0,{"$f":"VLOOKUP($J$4,Tabelle_Kürzel_Abwesenheit,Spalte_GT_Summe,FALSE)","v":0},"Ganztäg. Zeitentnahmen Jahr",null,{"$f":"VLOOKUP($J$4,Tabelle_Kürzel_Abwesenheit,Spalte_U_Summe,FALSE)","v":0},"Urlaub Jahr",{"$f":"VLOOKUP($J$4,Tabelle_Kürzel_Abwesenheit,Spalte_K_Summe,FALSE)","v":0},"krank Jahr"]
[null,null,null,null,null,null,null,null,null,"Gesamtsaldo",null,{"$f":"SUM(L41:L42)-L43","v":-0.19097222222222227}]
[]
[]
[null,null,"Vorgesetzten-",null,{"$f":"E4","v":"2021-12-31"},null,null,null,{"$f":"I4","v":"Monat:"},null,null,null,null,{"$f":"M4","v":"Vertragliche regelmäßige Wochenarbeitszeit: "},{"$f":"Y5","v":30},{"$f":"P5","v":"Std/Woche"}]
[null,null,"Meldung",null,null,null,null,null,null,{"$f":"J4","v":"November"}]
[null,null,{"$f":"C6","v":"Name:"},{"$f":"D6","v":0},null,null,{"$f":"G6","v":"Vorname:"},{"$f":"H6","v":0},null,null,null,null,{"$f":"M6","v":0}]
[null,null,null,null,null,null,null,null,null,{"$f":"J6","v":"Pers.-Nr.:"},{"$f":"K6","v":0},"Abteilung/Kostenstelle:",null,"Bemerkungen"]
[null,null,{"$f":"C8","v":"Datum"},"Kommen","Gehen","Anwesenh.",{"$f":"G8","v":"Gesamtzeit"},"Mittag","Arbeitszeit",{"$f":"J8","v":"Stunden"},"Bemerkungen"]
[null,null,"Tag","08:00:00","14:35:00","abs. u. TZ","10:00:00","00:35:00","06:00:00",{"$f":"J9","v":"Saldo"},null,"Hinweise",{"$f":"M9","v":"FT/U/GT/SD/K"}]
[{"$f":"A10","v":"So"},"0:00","2022-10-31",{"$f":"IF(D10=0,\" \",IF(OR($A53=\"Sa\",$A53=\"So\",$M53=\"FT\"),D10,IF(D10<$D$84,D10,\" \")))","v":" "},{"$f":"IF(E10=0,\" \",IF(OR($A53=\"Sa\",$A53=\"So\",$M53=\"FT\"),E10,IF(E10>$D$85,E10,\" \")))","v":" "},null,{"$f":"IF(G10=0,\" \",IF(G10-H10-O10>$H$85,G10,\" \"))","v":" "},{"$f":"IF(K10=\"->Pause<-\",\"Pause!\",\"\")","v":""},null,null,{"$f":"IF(G53<>\" \",\"AZ > 10 h\",\" \")","v":" "},{"$f":"IF(ISERROR(VLOOKUP(C53,Feiertage,2,FALSE))=TRUE,IF(E53<>\" \",\"Kommen/Gehen vor/nach 06:30/20:00\",IF(D53<>\" \",\"Kommen/Gehen vor/nach 06:30/20:00\",\" \")),VLOOKUP(C53,Feiertage,2,FALSE))","v":"Allerheiligen"},{"$f":"IF(Y10>0,Y10,\" \")","v":"FT"},null,null,null,null,null,null,null,null,null,null,null,{"$f":"Y10","v":"FT"}]
["Mo","06:00:00","2022-11-01"," "," ",null," ",{"$f":"IF(K11=\"->Pause<-\",\"Pause!\",\"\")","v":""},null,null," "," ","",null,null,null,null,null,null,null,null,null,null,null,""]
["Di","06:00:00","2022-11-02"," "," ",null," ","",null,null," "," ","",null,null,null,null,null,null,null,null,null,null,null,""]
["Mi","06:00:00","2022-11-03"," "," ",null," ","",null,null," "," ","",null,null,null,null,null,null,null,null,null,null,null,""]
["Do","06:00:00","2022-11-04"," "," ",null," ","",null,null," "," ","",null,null,null,null,null,null,null,null,null,null,null,""]
["Fr","06:00:00","2022-11-05"," "," ",null," ","",null,null," "," ","",null,null,null,null,null,null,null,null,null,null,null,""]
["Sa","0:00","2022-11-06"," "," ",null," ","",null,null," "," ","",null,null,null,null,null,null,null,null,null,null,null,""]
["So","0:00","2022-11-07"," "," ",null," ","",null,null," "," ","",null,null,null,null,null,null,null,null,null,null,null,""]
["Mo","06:00:00","2022-11-08"," "," ",null," ","",null,null," "," ","",null,null,null,null,null,null,null,null,null,null,null,""]
["Di","06:00:00","2022-11-09"," "," ",null," ","",null,null," "," ","",null,null,null,null,null,null,null,null,null,null,null,""]
["Mi","06:00:00","2022-11-10"," "," ",null," ","",null,null," "," ","",null,null,null,null,null,null,null,null,null,null,null,""]
["Do","06:00:00","2022-11-11"," "," ",null," ","",null,null," "," ","",null,null,null,null,null,null,null,null,null,null,null,""]
["Fr","06:00:00","2022-11-12"," "," ",null," ","",null,null," "," ","",null,null,null,null,null,null,null,null,null,null,null,""]
["Sa","0:00","2022-11-13"," "," ",null," ","",null,null," "," ","",null,null,null,null,null,null,null,null,null,null,null,""]
["So","0:00","2022-11-14"," "," ",null," ","",null,null," "," ","",null,null,null,null,null,null,null,null,null,null,null,""]
["Mo","06:00:00","2022-11-15"," "," ",null," ","",null,null," "," ","",null,null,null,null,null,null,null,null,null,null,null,""]
["Di","06:00:00","2022-11-16"," "," ",null," ","",null,null," "," ","",null,null,null,null,null,null,null,null,null,null,null,""]
["Mi","06:00:00","2022-11-17"," "," ",null," ","",null,null," "," ","",null,null,null,null,null,null,null,null,null,null,null,""]
["Do","06:00:00","2022-11-18"," "," ",null," ","",null,null," "," ","",null,null,null,null,null,null,null,null,null,null,null,""]
["Fr","06:00:00","2022-11-19"," "," ",null," ","",null,null," "," ","",null,null,null,null,null,null,null,null,null,null,null,""]
["Sa","0:00","2022-11-20"," "," ",null," ","",null,null," "," ","",null,null,null,null,null,null,null,null,null,null,null,""]
["So","0:00","2022-11-21"," "," ",null," ","",null,null," "," ","",null,null,null,null,null,null,null,null,null,null,null,""]
["Mo","06:00:00","2022-11-22"," "," ",null," ","",null,null," "," ","",null,null,null,null,null,null,null,null,null,null,null,""]
["Di","06:00:00","2022-11-23"," "," ",null," ","",null,null," "," ","",null,null,null,null,null,null,null,null,null,null,null,""]
["Mi","06:00:00","2022-11-24"," "," ",null," ","",null,null,{"$f":"IF(G77<>\" \",\"AZ > 10 h\",\" \")","v":" "}," ","",null,null,null,null,null,null,null,null,null,null,null,""]
["Do","06:00:00","2022-11-25"," "," ",null," ","",null,null," "," ","",null,null,null,null,null,null,null,null,null,null,null,""]
["Fr","06:00:00","2022-11-26"," "," ",null," ","",null,null," "," ","",null,null,null,null,null,null,null,null,null,null,null,""]
["Sa","0:00","2022-11-27"," "," ",null," ","",null,null," "," ","",null,null,null,null,null,null,null,null,null,null,null,""]
["So","0:00","2022-11-28"," "," ",null," ","",null,null," "," ","",null,null,null,null,null,null,null,null,null,null,null,""]
["Mo","06:00:00","2022-11-29"," "," ",null," ","",null,null," "," ","",null,null,null,null,null,null,null,null,null,null,null,""]
[null,null,"Meldegründe:",null,null,null,null,null,null,null,{"$f":"K41","v":"Mon.saldo"}]
[null,null,"vor","06:30:00",null,null,"Über 60 Stunden",{"$f":"H85*6","v":2.5},"Gesamtsaldo",{"$f":"J42","v":"+ Saldo / Vormonate"},null,null,{"$f":"M42","v":0},{"$f":"N42","v":"Ganztäg. Zeitentnahmen lfd. Monat"}]
[null,null,"nach ","20:00:00",null,null,"Über",{"$f":"G9","v":"10:00:00"},"Std. tägl.","- Auszahlungen",null,{"$f":"L42","v":-0.19097222222222227},{"$f":"M43","v":0},{"$f":"N43","v":"Ganztäg. Zeitentnahmen Jahr"}]
[{"$f":"Januar!A87","v":"V 2026.1"},null,{"$f":"\"mobile Work / Telearbeit: \"&IF(H4=\"Ja\",'mW-HO'!AG37&\"%\",\"n.a.\")","v":"mobile Work / Telearbeit: 0%"},null,null,null,"unter -20 Stunden",{"$f":"-H85*2","v":-0.83333333333333337},"Gesamtsaldo",{"$f":"J44","v":"Gesamtsaldo"},null,{"$f":"IF(H84>L44,\" \",L44)","v":" "}]
[null,null,null,null,null,null,null,null,null,null,null,{"$f":"IF(H86>L44,L44,\" \")","v":" "}]

{"sheet":"Dezember","index":12,"n_rows":87,"n_cols":27,"rows_kept":87,"cut":false,"hidden":false,"merged":[[7,19,7,22],[7,15,7,18],[85,2,85,4],[6,11,6,13],[0,0,0,1],[1,0,1,1],[47,3,47,4],[47,7,47,8],[5,7,5,8],[5,3,5,4],[3,5,3,6]]}
[{"$f":"L44","v":-0.19097222222222227},null,"Gesamtsaldo",null,null,null,null,null,null,null,null,null,null,null,null,"Tages-","Mo",{"$f":"INDIRECT(\"'\"&$Y$2&\"'!\"&CELL(\"address\",R1))","v":0.25},null,null,null,null,null,null,"Hilfsspalte","Urlaubstage"]
[{"$f":"L41","v":0},null,"Dieser Monat",null,null,null,null,null,null,null,null,null,null,null,null,"arbeitszeit","Di",0.25,null,null,null,null,null,null,"November"]
[null,null,null,null,null,null,null,null,null,null,null,null,null,null,null,null,"Mi",0.25]
[null,null,"Anwesenheitsliste",null,{"$f":"Januar!E4","v":"2021-12-31"},"Report HO/mW Stat.:",null,"Ja","Monat:",{"$f":"VLOOKUP(MONTH(C10),Text_Monatsname,2,FALSE)","v":"Dezember"},null,null,"Vertragliche regelmäßige Wochenarbeitszeit: ","\"hh:mm\"",{"$f":"IF(INDIRECT(\"'\"&$Y$2&\"'!\"&CELL(\"address\",O4))=\"\",\"\",INDIRECT(\"'\"&$Y$2&\"'!\"&CELL(\"address\",O4)))","v":1.25},null,"Do",0.25,null,null,null,null,null,null,{"$f":"Y5*Y6","v":1.25}]
[null,null,null,null,null,null,null,null,null,null,null,null,null,"oder: Industrieminuten \"hh,<1/10 h>\"",{"$f":"IF(INDIRECT(\"'\"&$Y$2&\"'!\"&CELL(\"address\",O5))=\"\",\"\",INDIRECT(\"'\"&$Y$2&\"'!\"&CELL(\"address\",O5)))","v":""},"Std/Woche","Fr",0.25,{"$f":"SUM(R1:R7)","v":1.25},null,null,null,null,null,{"$f":"IF(O4<>\"\",IF(O5=\"\",(DAY(O4)*24-24)+HOUR(O4)+MINUTE(O4)/60,IF(O5*Y6=O4,O5,\"Fehler\")),IF(O5<>\"\",O5,\"Fehler\"))","v":30}]
[null,null,"Name:",{"$f":"INDIRECT(\"'\"&$Y$2&\"'!\"&CELL(\"address\",D6))","v":0},null,null,"Vorname:",{"$f":"INDIRECT(\"'\"&$Y$2&\"'!\"&CELL(\"address\",H6))","v":0},null,"Pers.-Nr.:",{"$f":"INDIRECT(\"'\"&$Y$2&\"'!\"&CELL(\"address\",K6))","v":0},"Abteilung/Kostenstelle:",{"$f":"INDIRECT(\"'\"&$Y$2&\"'!\"&CELL(\"address\",M6))","v":0},null,{"$f":"IF(Y5=\"Fehler\",\"nur ein Wert!\",\"\")","v":""},"Mittagspause","Sa",0,{"$f":"IF(Y4=S5,\"Saldo O.K.\",\"Saldo falsch\")","v":"Saldo O.K."},null,null,null,null,null,"01:00:00"]
[null,null,null,null,null,null,null,null,null,null,null,"Mittagspause (Ja / Nein)  ",null,null,{"$f":"INDIRECT(\"'\"&$Y$2&\"'!\"&CELL(\"address\",O7))","v":"Ja"},{"$f":"INDIRECT(\"'\"&$Y$2&\"'!\"&CELL(\"address\",P7))","v":"00:35:00"},"So",0]
[null,"Soll","Datum","Kommen","Gehen","Anwesenh.","Gesamtzeit","Mittag","Arbeitszeit","Stunden","Bemerkungen",null,"Dienstl./Sonstige Abwesenheit",null,null,"Dokumentation sonstige Abwesenheit",null,null,null,"zusätzliche Reisezeit"]
[null,"Std","Tag","08:00:00",{"$f":"D9+I9+H9","v":"08:35:00"},"abs. u. TZ","10:00:00",{"$f":"IF(O7=\"NEIN\",0,P7)","v":"00:35:00"},{"$f":"AC4/5","v":"00:00:00"},"Saldo",null,"Hinweise","FT/U/GT/SD/K","SAR","Korrektur","von","bis","von","bis","von","bis","von","bis",null,null,{"$f":"VLOOKUP(J4,Werte_UrlaubstageProMonat,2,FALSE)","v":0}]
[{"$f":"VLOOKUP(WEEKDAY(C10,2),Text_Wochentag,2)","v":"Di"},{"$f":"IF(OR(A10=\"Sa\",A10=\"So\"),\"0:00\",IF(Y10=\"FT\",\"0:00\",$I$9))","v":"00:00:00"},{"$f":"November!C39+1","v":"2022-11-30"},"00:00:00","00:00:00",null,{"$f":"IF(I10=\" \",0,I10 + IF(N10=\"Ja\", (U10-T10) + (W10-V10),0))","v":"00:00:00"},{"$f":"$H$9","v":"00:35:00"},{"$f":"IFERROR(IF(E10=0,IF(D10=0,\" \",E10-D10+F10-H10),TIME(HOUR(E10-D10+F10),MINUTE(E10-D10+F10),0)-H10) - IF(N10=\"Ja\",(Q10-P10) + (S10-R10),0),\" \")","v":" "},{"$f":"IF(Y10=\"GT\",-B10,IF(E10>0,G10-B10,IF(F10>0,G10-B10,\"     ---   \")))","v":"     ---   "},{"$f":"IF(G10<0,$I$9+D10+H10+O10, IFERROR(IF(OR(AND((I10*24)>9,((H10+IF(N10=\"Ja\",(Q10-P10)+(S10-R10),0))*24*60)<45),AND((I10*24)>6,((H10+IF(N10=\"Ja\",(Q10-P10)+(S10-R10),0))*24*60)<30)),\"->Pause<-\",\"\"),\"\"))","v":""},{"$f":"IF(ISERROR(VLOOKUP(C10,Feiertage,2,FALSE))=TRUE,IF(G10<0,\"Uhr  mind. Arbeitszeit\",IF(AND(I10<>\" \",I10>$G$9),\"Arbeitszeit >10 Std.\",\" \")),VLOOKUP(C10,Feiertage,2,FALSE))","v":" "},{"$f":"IF(ISERROR(VLOOKUP(C10,Feiertage,2,FALSE))=TRUE,\"\",\"FT\")","v":""},null,{"$f":"IF(N10=\"Ja\",((U10-T10)+(W10-V10))-((Q10-P10)+(S10-R10)),0)","v":0},null,null,null,null,null,null,null,null,null,{"$f":"UPPER(TRIM(M10))","v":""},{"$f":"IF(AA10=\"\",\"\",MAX(Z$9:Z9)+1)","v":""},{"$f":"IF(M10=\"U\",C10,\"\")","v":""}]
["Mi",{"$f":"IF(OR(A11=\"Sa\",A11=\"So\"),\"0:00\",IF(Y11=\"FT\",\"0:00\",$I$9))","v":"00:00:00"},{"$f":"C10+1","v":"2022-12-01"},"00:00:00","00:00:00",null,{"$f":"IF(I11=\" \",0,I11 + IF(N11=\"Ja\", (U11-T11) + (W11-V11),0))","v":"00:00:00"},"00:35:00",{"$f":"IFERROR(IF(E11=0,IF(D11=0,\" \",E11-D11+F11-H11),TIME(HOUR(E11-D11+F11),MINUTE(E11-D11+F11),0)-H11) - IF(N11=\"Ja\",(Q11-P11) + (S11-R11),0),\" \")","v":" "},{"$f":"IF(Y11=\"GT\",-B11,IF(E11>0,G11-B11,IF(F11>0,G11-B11,\"     ---   \")))","v":"     ---   "},{"$f":"IF(G11<0,$I$9+D11+H11+O11, IFERROR(IF(OR(AND((I11*24)>9,((H11+IF(N11=\"Ja\",(Q11-P11)+(S11-R11),0))*24*60)<45),AND((I11*24)>6,((H11+IF(N11=\"Ja\",(Q11-P11)+(S11-R11),0))*24*60)<30)),\"->Pause<-\",\"\"),\"\"))","v":""}," ","",null,{"$f":"IF(N11=\"Ja\",((U11-T11)+(W11-V11))-((Q11-P11)+(S11-R11)),0)","v":0},null,null,null,null,null,null,null,null,null,"",{"$f":"IF(AA11=\"\",\"\",MAX(Z$9:Z10)+1)","v":""},{"$f":"IF(M11=\"U\",C11,\"\")","v":""}]
["Do","00:00:00","2022-12-02","00:00:00","00:00:00",null,"00:00:00","00:35:00"," ","     ---   ",""," ","",null,0,null,null,null,null,null,null,null,null,null,"",{"$f":"IF(AA12=\"\",\"\",MAX(Z$9:Z11)+1)","v":""},""]
["Fr","00:00:00","2022-12-03","00:00:00","00:00:00",null,"00:00:00","00:35:00"," ","     ---   ",""," ","",null,0,null,null,null,null,null,null,null,null,null,"",{"$f":"IF(AA13=\"\",\"\",MAX(Z$9:Z12)+1)","v":""},""]
["Sa","0:00","2022-12-04","00:00:00","00:00:00",null,"00:00:00","00:35:00"," ","     ---   ",""," ","",null,0,null,null,null,null,null,null,null,null,null,"",{"$f":"IF(AA14=\"\",\"\",MAX(Z$9:Z13)+1)","v":""},""]
["So","0:00","2022-12-05","00:00:00","00:00:00",null,"00:00:00","00:35:00"," ","     ---   ",""," ","",null,0,null,null,null,null,null,null,null,null,null,"",{"$f":"IF(AA15=\"\",\"\",MAX(Z$9:Z14)+1)","v":""},""]
["Mo","00:00:00","2022-12-06","00:00:00","00:00:00",null,"00:00:00","00:35:00"," ","     ---   ",""," ","",null,0,null,null,null,null,null,null,null,null,null,"",{"$f":"IF(AA16=\"\",\"\",MAX(Z$9:Z15)+1)","v":""},""]
["Di","00:00:00","2022-12-07","00:00:00","00:00:00",null,"00:00:00","00:35:00"," ","     ---   ",""," ","",null,0,null,null,null,null,null,null,null,null,null,"",{"$f":"IF(AA17=\"\",\"\",MAX(Z$9:Z16)+1)","v":""},""]
["Mi","00:00:00","2022-12-08","00:00:00","00:00:00",null,"00:00:00","00:35:00"," ","     ---   ",""," ","",null,0,null,null,null,null,null,null,null,null,null,"",{"$f":"IF(AA18=\"\",\"\",MAX(Z$9:Z17)+1)","v":""},""]
["Do","00:00:00","2022-12-09","00:00:00","00:00:00",null,"00:00:00","00:35:00"," ","     ---   ",""," ",null,null,0,null,null,null,null,null,null,null,null,null,"",{"$f":"IF(AA19=\"\",\"\",MAX(Z$9:Z18)+1)","v":""},""]
["Fr","00:00:00","2022-12-10","00:00:00","00:00:00",null,"00:00:00","00:35:00"," ","     ---   ",""," ","",null,0,null,null,null,null,null,null,null,null,null,"",{"$f":"IF(AA20=\"\",\"\",MAX(Z$9:Z19)+1)","v":""},""]
["Sa","0:00","2022-12-11","00:00:00","00:00:00",null,"00:00:00","00:35:00"," ","     ---   ",""," ",null,null,0,null,null,null,null,null,null,null,null,null,"",{"$f":"IF(AA21=\"\",\"\",MAX(Z$9:Z20)+1)","v":""},""]
["So","0:00","2022-12-12","00:00:00","00:00:00",null,"00:00:00","00:35:00"," ","     ---   ",""," ","",null,0,null,null,null,null,null,null,null,null,null,"",{"$f":"IF(AA22=\"\",\"\",MAX(Z$9:Z21)+1)","v":""},""]
["Mo","00:00:00","2022-12-13","00:00:00","00:00:00",null,"00:00:00","00:35:00"," ","     ---   ",""," ","",null,0,null,null,null,null,null,null,null,null,null,"",{"$f":"IF(AA23=\"\",\"\",MAX(Z$9:Z22)+1)","v":""},""]
["Di","00:00:00","2022-12-14","00:00:00","00:00:00",null,"00:00:00","00:35:00"," ","     ---   ",""," ","",null,0,null,null,null,null,null,null,null,null,null,"",{"$f":"IF(AA24=\"\",\"\",MAX(Z$9:Z23)+1)","v":""},""]
["Mi","00:00:00","2022-12-15","00:00:00","00:00:00",null,"00:00:00","00:35:00"," ","     ---   ",""," ","",null,0,null,null,null,null,null,null,null,null,null,"",{"$f":"IF(AA25=\"\",\"\",MAX(Z$9:Z24)+1)","v":""},""]
["Do","00:00:00","2022-12-16","00:00:00","00:00:00",null,"00:00:00","00:35:00"," ","     ---   ",""," ","",null,0,null,null,null,null,null,null,null,null,null,"",{"$f":"IF(AA26=\"\",\"\",MAX(Z$9:Z25)+1)","v":""},""]
["Fr","00:00:00","2022-12-17","00:00:00","00:00:00",null,"00:00:00","00:35:00"," ","     ---   ",""," ","",null,0,null,null,null,null,null,null,null,null,null,"",{"$f":"IF(AA27=\"\",\"\",MAX(Z$9:Z26)+1)","v":""},""]
["Sa","0:00","2022-12-18","00:00:00","00:00:00",null,"00:00:00","00:35:00"," ","     ---   ",""," ","",null,0,null,null,null,null,null,null,null,null,null,"",{"$f":"IF(AA28=\"\",\"\",MAX(Z$9:Z27)+1)","v":""},""]
["So","0:00","2022-12-19","00:00:00","00:00:00",null,"00:00:00","00:35:00"," ","     ---   ",""," ","",null,0,null,null,null,null,null,null,null,null,null,"",{"$f":"IF(AA29=\"\",\"\",MAX(Z$9:Z28)+1)","v":""},""]
["Mo","00:00:00","2022-12-20","00:00:00","00:00:00",null,"00:00:00","00:35:00"," ","     ---   ",""," ","",null,0,null,null,null,null,null,null,null,null,null,"",{"$f":"IF(AA30=\"\",\"\",MAX(Z$9:Z29)+1)","v":""},""]
["Di","00:00:00","2022-12-21","00:00:00","00:00:00",null,"00:00:00","00:35:00"," ","     ---   ",""," ","",null,0,null,null,null,null,null,null,null,null,null,"",{"$f":"IF(AA31=\"\",\"\",MAX(Z$9:Z30)+1)","v":""},""]
["Mi","00:00:00","2022-12-22","00:00:00","00:00:00",null,"00:00:00","00:35:00"," ","     ---   ",""," ","",null,0,null,null,null,null,null,null,null,null,null,"",{"$f":"IF(AA32=\"\",\"\",MAX(Z$9:Z31)+1)","v":""},""]
["Do","0:00","2022-12-23","00:00:00","00:00:00",null,"00:00:00","00:35:00"," ","     ---   ","","Heilig Abend","FT",null,0,null,null,null,null,null,null,null,null,null,"FT",{"$f":"IF(AA33=\"\",\"\",MAX(Z$9:Z32)+1)","v":""},""]
["Fr","0:00","2022-12-24","00:00:00","00:00:00",null,"00:00:00","00:35:00"," ","     ---   ","","1. Weihnachtstag","FT",null,0,null,null,null,null,null,null,null,null,null,"FT",{"$f":"IF(AA34=\"\",\"\",MAX(Z$9:Z33)+1)","v":""},""]
["Sa","0:00","2022-12-25","00:00:00","00:00:00",null,"00:00:00","00:35:00"," ","     ---   ","","2. Weihnachtstag ","FT ",null,0,null,null,null,null,null,null,null,null,null,"FT",{"$f":"IF(AA35=\"\",\"\",MAX(Z$9:Z34)+1)","v":""},""]
["So","0:00","2022-12-26","00:00:00","00:00:00",null,"00:00:00","00:35:00"," ","     ---   ",""," ","",null,0,null,null,null,null,null,null,null,null,null,"",{"$f":"IF(AA36=\"\",\"\",MAX(Z$9:Z35)+1)","v":""},""]
["Mo","00:00:00","2022-12-27","00:00:00","00:00:00",null,"00:00:00","00:35:00"," ","     ---   ",""," ","",null,0,null,null,null,null,null,null,null,null,null,"",{"$f":"IF(AA37=\"\",\"\",MAX(Z$9:Z36)+1)","v":""},""]
["Di","00:00:00","2022-12-28","00:00:00","00:00:00",null,"00:00:00","00:35:00"," ","     ---   ",""," ","",null,0,null,null,null,null,null,null,null,null,null,"",{"$f":"IF(AA38=\"\",\"\",MAX(Z$9:Z37)+1)","v":""},""]
["Mi","00:00:00","2022-12-29","00:00:00","00:00:00",null,"00:00:00","00:35:00"," ","     ---   ",""," ","",null,0,null,null,null,null,null,null,null,null,null,"",{"$f":"IF(AA39=\"\",\"\",MAX(Z$9:Z38)+1)","v":""},""]
["Do","0:00","2022-12-30","00:00:00","00:00:00",null,"00:00:00","00:35:00"," ","     ---   ","","Silvester","FT",null,0,null,null,null,null,null,null,null,null,null,"FT",{"$f":"IF(AA40=\"\",\"\",MAX(Z$9:Z39)+1)","v":""},""]
[null,null,null,null,null,null,null,null,null,{"$f":"SUM(J10:J40)","v":0},"Mon.saldo",{"$f":"J41","v":0},"   *) Tragen Sie bitte ggf. für die beiden halben Betriebsschließungstage 24./31.12. zusammen 1x Urlaub o.ä. am 24.12. ein.",null,null,null,null,null,null,null,null,null,null,null,null,{"$f":"MAX(Z9:Z40)","v":0},{"$f":"COUNT(AA10:AA40)","v":0}]
[null,null,null,null,null,null,null,null,null,"+ Saldo / Vormonate",null,{"$f":"November!L44","v":-0.19097222222222227},{"$f":"VLOOKUP($J$4,Tabelle_Kürzel_Abwesenheit,Spalte_GT_Monat,FALSE)","v":0},"Ganztäg. Zeitentnahmen lfd. Monat",null,{"$f":"VLOOKUP($J$4,Tabelle_Kürzel_Abwesenheit,Spalte_U_Monat,FALSE)","v":0},"Urlaub lfd. Monat",{"$f":"VLOOKUP($J$4,Tabelle_Kürzel_Abwesenheit,Spalte_K_Monat,FALSE)","v":0},"krank lfd. Monat"]
[null,null,null,null,null,null,null,null,null,"- Auszahlungen",null,0,{"$f":"VLOOKUP($J$4,Tabelle_Kürzel_Abwesenheit,Spalte_GT_Summe,FALSE)","v":0},"Ganztäg. Zeitentnahmen Jahr",null,{"$f":"VLOOKUP($J$4,Tabelle_Kürzel_Abwesenheit,Spalte_U_Summe,FALSE)","v":0},"Urlaub Jahr",{"$f":"VLOOKUP($J$4,Tabelle_Kürzel_Abwesenheit,Spalte_K_Summe,FALSE)","v":0},"krank Jahr"]
[null,null,null,null,null,null,null,null,null,"Gesamtsaldo",null,{"$f":"SUM(L41:L42)-L43","v":-0.19097222222222227}]
[]
[null,null,"Vorgesetzten-",null,{"$f":"E4","v":"2021-12-31"},null,null,null,{"$f":"I4","v":"Monat:"},null,null,null,null,{"$f":"M4","v":"Vertragliche regelmäßige Wochenarbeitszeit: "},{"$f":"Y5","v":30},{"$f":"P5","v":"Std/Woche"}]
[null,null,"Meldung",null,null,null,null,null,null,{"$f":"J4","v":"Dezember"}]
[null,null,{"$f":"C6","v":"Name:"},{"$f":"D6","v":0},null,null,{"$f":"G6","v":"Vorname:"},{"$f":"H6","v":0},null,null,null,null,{"$f":"M6","v":0}]
[null,null,null,null,null,null,null,null,null,{"$f":"J6","v":"Pers.-Nr.:"},{"$f":"K6","v":0},"Abteilung/Kostenstelle:",null,"Bemerkungen"]
[null,null,{"$f":"C8","v":"Datum"},"Kommen","Gehen","Anwesenh.",{"$f":"G8","v":"Gesamtzeit"},"Mittag","Arbeitszeit",{"$f":"J8","v":"Stunden"},"Bemerkungen"]
[null,null,"Tag","08:00:00","08:35:00","abs. u. TZ","10:00:00","00:35:00","00:00:00",{"$f":"J9","v":"Saldo"},null,"Hinweise",{"$f":"M9","v":"FT/U/GT/SD/K"}]
[{"$f":"A10","v":"Di"},"00:00:00","2022-11-30",{"$f":"IF(D10=0,\" \",IF(OR($A52=\"Sa\",$A52=\"So\",$M52=\"FT\"),D10,IF(D10<$D$84,D10,\" \")))","v":" "},{"$f":"IF(E10=0,\" \",IF(OR($A52=\"Sa\",$A52=\"So\",$M52=\"FT\"),E10,IF(E10>$D$85,E10,\" \")))","v":" "},null,{"$f":"IF(G10=0,\" \",IF(G10-H10-O10>$H$85,G10,\" \"))","v":" "},{"$f":"IF(K10=\"->Pause<-\",\"Pause!\",\"\")","v":""},null,null,{"$f":"IF(G52<>\" \",\"AZ > 10 h\",\" \")","v":" "},{"$f":"IF(ISERROR(VLOOKUP(C52,Feiertage,2,FALSE))=TRUE,IF(E52<>\" \",\"Kommen/Gehen vor/nach 06:30/20:00\",IF(D52<>\" \",\"Kommen/Gehen vor/nach 06:30/20:00\",\" \")),VLOOKUP(C52,Feiertage,2,FALSE))","v":" "},{"$f":"IF(Y10>0,Y10,\" \")","v":""},null,null,null,null,null,null,null,null,null,null,null,{"$f":"Y10","v":""}]
["Mi","00:00:00","2022-12-01"," "," ",null," ",{"$f":"IF(K11=\"->Pause<-\",\"Pause!\",\"\")","v":""},null,null," "," ",{"$f":"IF(Y11>0,Y11,\" \")","v":""},null,null,null,null,null,null,null,null,null,null,null,""]
["Do","00:00:00","2022-12-02"," "," ",null," ","",null,null," "," ","",null,null,null,null,null,null,null,null,null,null,null,""]
["Fr","00:00:00","2022-12-03"," "," ",null," ","",null,null," "," ","",null,null,null,null,null,null,null,null,null,null,null,""]
["Sa","0:00","2022-12-04"," "," ",null," ","",null,null," "," ","",null,null,null,null,null,null,null,null,null,null,null,""]
["So","0:00","2022-12-05"," "," ",null," ","",null,null," "," ","",null,null,null,null,null,null,null,null,null,null,null,""]
["Mo","00:00:00","2022-12-06"," "," ",null," ","",null,null," "," ","",null,null,null,null,null,null,null,null,null,null,null,""]
["Di","00:00:00","2022-12-07"," "," ",null," ","",null,null," "," ","",null,null,null,null,null,null,null,null,null,null,null,""]
["Mi","00:00:00","2022-12-08"," "," ",null," ","",null,null," "," ","",null,null,null,null,null,null,null,null,null,null,null,""]
["Do","00:00:00","2022-12-09"," "," ",null," ","",null,null," "," ","",null,null,null,null,null,null,null,null,null,null,null,""]
["Fr","00:00:00","2022-12-10"," "," ",null," ","",null,null," "," ","",null,null,null,null,null,null,null,null,null,null,null,""]
["Sa","0:00","2022-12-11"," "," ",null," ","",null,null," "," ","",null,null,null,null,null,null,null,null,null,null,null,""]
["So","0:00","2022-12-12"," "," ",null," ","",null,null," "," ","",null,null,null,null,null,null,null,null,null,null,null,""]
["Mo","00:00:00","2022-12-13"," "," ",null," ","",null,null," "," ","",null,null,null,null,null,null,null,null,null,null,null,""]
["Di","00:00:00","2022-12-14"," "," ",null," ","",null,null," "," ","",null,null,null,null,null,null,null,null,null,null,null,""]
["Mi","00:00:00","2022-12-15"," "," ",null," ","",null,null," "," ","",null,null,null,null,null,null,null,null,null,null,null,""]
["Do","00:00:00","2022-12-16"," "," ",null," ","",null,null," "," ","",null,null,null,null,null,null,null,null,null,null,null,""]
["Fr","00:00:00","2022-12-17"," "," ",null," ","",null,null," "," ","",null,null,null,null,null,null,null,null,null,null,null,""]
["Sa","0:00","2022-12-18"," "," ",null," ","",null,null," "," ","",null,null,null,null,null,null,null,null,null,null,null,""]
["So","0:00","2022-12-19"," "," ",null," ","",null,null," "," ","",null,null,null,null,null,null,null,null,null,null,null,""]
["Mo","00:00:00","2022-12-20"," "," ",null," ","",null,null," "," ","",null,null,null,null,null,null,null,null,null,null,null,""]
["Di","00:00:00","2022-12-21"," "," ",null," ","",null,null," "," ","",null,null,null,null,null,null,null,null,null,null,null,""]
["Mi","00:00:00","2022-12-22"," "," ",null," ","",null,null," "," ","",null,null,null,null,null,null,null,null,null,null,null,""]
["Do","0:00","2022-12-23"," "," ",null," ","",null,null," ","Heilig Abend","FT",null,null,null,null,null,null,null,null,null,null,null,"FT"]
["Fr","0:00","2022-12-24"," "," ",null," ","",null,null," ","1. Weihnachtstag","FT",null,null,null,null,null,null,null,null,null,null,null,"FT"]
["Sa","0:00","2022-12-25"," "," ",null," ","",null,null," ","2. Weihnachtstag ","FT",null,null,null,null,null,null,null,null,null,null,null,"FT"]
["So","0:00","2022-12-26"," "," ",null," ","",null,null," "," ","",null,null,null,null,null,null,null,null,null,null,null,""]
["Mo","00:00:00","2022-12-27"," "," ",null,{"$f":"IF(G37=0,\" \",IF(G37-H37-O37>$H$85,G37,\" \"))","v":" "},"",null,null," "," ","",null,null,null,null,null,null,null,null,null,null,null,""]
["Di","00:00:00","2022-12-28"," "," ",null,{"$f":"IF(G38=0,\" \",IF(G38-H38-O38>$H$85,G38,\" \"))","v":" "},"",null,null," "," ","",null,null,null,null,null,null,null,null,null,null,null,""]
["Mi","00:00:00","2022-12-29"," "," ",null,{"$f":"IF(G39=0,\" \",IF(G39-H39-O39>$H$85,G39,\" \"))","v":" "},"",null,null," "," ","",null,null,null,null,null,null,null,null,null,null,null,""]
["Do","0:00","2022-12-30"," "," ",null,{"$f":"IF(G40=0,\" \",IF(G40-H40-O40>$H$85,G40,\" \"))","v":" "},"",null,null," ","Silvester","FT",null,null,null,null,null,null,null,null,null,null,null,"FT"]
[null,null,"Meldegründe:",null,null,null,null,null,null,null,{"$f":"K41","v":"Mon.saldo"}]
[null,null,"vor","06:30:00",null,null,"Über 60 Stunden",{"$f":"H85*6","v":2.5},"Gesamtsaldo",{"$f":"J42","v":"+ Saldo / Vormonate"},null,null,{"$f":"M42","v":0},{"$f":"N42","v":"Ganztäg. Zeitentnahmen lfd. Monat"}]
[null,null,"nach ","20:00:00",null,null,"Über",{"$f":"G9","v":"10:00:00"},"Std. tägl.","- Auszahlungen",null,{"$f":"L42","v":-0.19097222222222227},{"$f":"M43","v":0},{"$f":"N43","v":"Ganztäg. Zeitentnahmen Jahr"}]
[{"$f":"Januar!A87","v":"V 2026.1"},null,{"$f":"\"mobile Work / Telearbeit: \"&IF(H4=\"Ja\",'mW-HO'!AJ37&\"%\",\"n.a.\")","v":"mobile Work / Telearbeit: 0%"},null,null,null,"unter -20 Stunden",{"$f":"-H85*2","v":-0.83333333333333337},"Gesamtsaldo",{"$f":"J44","v":"Gesamtsaldo"},null,{"$f":"IF(H84>L44,\" \",L44)","v":" "}]
[null,null,null,null,null,null,null,null,null,null,null,{"$f":"IF(H86>L44,L44,\" \")","v":" "}]

{"sheet":"mW-HO","index":13,"n_rows":49,"n_cols":37,"rows_kept":49,"cut":false,"hidden":false,"merged":[[37,1,37,36],[1,1,1,3],[1,4,1,6],[1,7,1,9],[1,10,1,12],[1,13,1,15],[1,31,1,33],[1,34,1,36],[1,16,1,18],[1,19,1,21],[1,22,1,24],[1,25,1,27],[1,28,1,30]]}
[]
["Anteil","Januar",null,null,"Februar",null,null,"März",null,null,"April",null,null,"Mai",null,null,"Juni",null,null,"Juli",null,null,"August",null,null,"September",null,null,"Oktober",null,null,"November",null,null,"Dezember"]
[1,{"$f":"Januar!A10","v":"Do"},{"$f":"IF(B3<>0,IF(OR(B3=\"So\",B3=\"Sa\"),\"WE\",IF(Januar!$M10=\"\",IF(TYPE(Januar!$I10)=2,\"\",\"-\"),Januar!$M10)),0)","v":"U"},{"$f":"IF(OR(C3=\"-\",C3=\"SD/SS\",C3=\"HO/mW\"),1,0)","v":0},{"$f":"Februar!$A10","v":"So"},{"$f":"IF(E3<>0,IF(OR(E3=\"So\",E3=\"Sa\"),\"WE\",IF(Februar!$M10=\"\",IF(TYPE(Februar!$I10)=2,\"\",\"-\"),Februar!$M10)),0)","v":"WE"},{"$f":"IF(OR(F3=\"-\",F3=\"SD/SS\",F3=\"HO/mW\"),1,0)","v":0},{"$f":"März!$A10","v":"So"},{"$f":"IF(H3<>0,IF(OR(H3=\"So\",H3=\"Sa\"),\"WE\",IF(März!$M10=\"\",IF(TYPE(März!$I10)=2,\"\",\"-\"),März!$M10)),0)","v":"WE"},{"$f":"IF(OR(I3=\"-\",I3=\"SD/SS\",I3=\"HO/mW\"),1,0)","v":0},{"$f":"April!$A10","v":"Mi"},{"$f":"IF(K3<>0,IF(OR(K3=\"So\",K3=\"Sa\"),\"WE\",IF(April!$M10=\"\",IF(TYPE(April!$I10)=2,\"\",\"-\"),April!$M10)),0)","v":""},{"$f":"IF(OR(L3=\"-\",L3=\"SD/SS\",L3=\"HO/mW\"),1,0)","v":0},{"$f":"Mai!$A10","v":"Fr"},{"$f":"IF(N3<>0,IF(OR(N3=\"So\",N3=\"Sa\"),\"WE\",IF(Mai!$M10=\"\",IF(TYPE(Mai!$I10)=2,\"\",\"-\"),Mai!$M10)),0)","v":"FT"},{"$f":"IF(OR(O3=\"-\",O3=\"SD/SS\",O3=\"HO/mW\"),1,0)","v":0},{"$f":"Juni!$A10","v":"Mo"},{"$f":"IF(Q3<>0,IF(OR(Q3=\"So\",Q3=\"Sa\"),\"WE\",IF(Juni!$M10=\"\",IF(TYPE(Juni!$I10)=2,\"\",\"-\"),Juni!$M10)),0)","v":""},{"$f":"IF(OR(R3=\"-\",R3=\"SD/SS\",R3=\"HO/mW\"),1,0)","v":0},{"$f":"Juli!$A10","v":"Mi"},{"$f":"IF(T3<>0,IF(OR(T3=\"So\",T3=\"Sa\"),\"WE\",IF(Juli!$M10=\"\",IF(TYPE(Juli!$I10)=2,\"\",\"-\"),Juli!$M10)),0)","v":""},{"$f":"IF(OR(U3=\"-\",U3=\"SD/SS\",U3=\"HO/mW\"),1,0)","v":0},{"$f":"August!$A10","v":"Sa"},{"$f":"IF(W3<>0,IF(OR(W3=\"So\",W3=\"Sa\"),\"WE\",IF(August!$M10=\"\",IF(TYPE(August!$I10)=2,\"\",\"-\"),August!$M10)),0)","v":"WE"},{"$f":"IF(OR(X3=\"-\",X3=\"SD/SS\",X3=\"HO/mW\"),1,0)","v":0},{"$f":"September!$A10","v":"Di"},{"$f":"IF(Z3<>0,IF(OR(Z3=\"So\",Z3=\"Sa\"),\"WE\",IF(September!$M10=\"\",IF(TYPE(September!$I10)=2,\"\",\"-\"),September!$M10)),0)","v":""},{"$f":"IF(OR(AA3=\"-\",AA3=\"SD/SS\",AA3=\"HO/mW\"),1,0)","v":0},{"$f":"Oktober!$A10","v":"Do"},{"$f":"IF(AC3<>0,IF(OR(AC3=\"So\",AC3=\"Sa\"),\"WE\",IF(Oktober!$M10=\"\",IF(TYPE(Oktober!$I10)=2,\"\",\"-\"),Oktober!$M10)),0)","v":""},{"$f":"IF(OR(AD3=\"-\",AD3=\"SD/SS\",AD3=\"HO/mW\"),1,0)","v":0},{"$f":"November!$A10","v":"So"},{"$f":"IF(AF3<>0,IF(OR(AF3=\"So\",AF3=\"Sa\"),\"WE\",IF(November!$M10=\"\",IF(TYPE(November!$I10)=2,\"\",\"-\"),November!$M10)),0)","v":"WE"},{"$f":"IF(OR(AG3=\"-\",AG3=\"SD/SS\",AG3=\"HO/mW\"),1,0)","v":0},{"$f":"Dezember!$A10","v":"Di"},{"$f":"IF(AI3<>0,IF(OR(AI3=\"So\",AI3=\"Sa\"),\"WE\",IF(Dezember!$M10=\"\",IF(TYPE(Dezember!$I10)=2,\"\",\"-\"),Dezember!$M10)),0)","v":""},{"$f":"IF(OR(AJ3=\"-\",AJ3=\"SD/SS\",AJ3=\"HO/mW\"),1,0)","v":0}]
[2,{"$f":"Januar!A11","v":"Fr"},{"$f":"IF(B4<>0,IF(OR(B4=\"So\",B4=\"Sa\"),\"WE\",IF(Januar!$M11=\"\",IF(TYPE(Januar!$I11)=2,\"\",\"-\"),Januar!$M11)),0)","v":"U"},0,{"$f":"Februar!A11","v":"Mo"},{"$f":"IF(E4<>0,IF(OR(E4=\"So\",E4=\"Sa\"),\"WE\",IF(Februar!$M11=\"\",IF(TYPE(Februar!$I11)=2,\"\",\"-\"),Februar!$M11)),0)","v":""},0,{"$f":"März!$A11","v":"Mo"},{"$f":"IF(H4<>0,IF(OR(H4=\"So\",H4=\"Sa\"),\"WE\",IF(März!$M11=\"\",IF(TYPE(März!$I11)=2,\"\",\"-\"),März!$M11)),0)","v":""},0,{"$f":"April!$A11","v":"Do"},{"$f":"IF(K4<>0,IF(OR(K4=\"So\",K4=\"Sa\"),\"WE\",IF(April!$M11=\"\",IF(TYPE(April!$I11)=2,\"\",\"-\"),April!$M11)),0)","v":""},0,{"$f":"Mai!$A11","v":"Sa"},{"$f":"IF(N4<>0,IF(OR(N4=\"So\",N4=\"Sa\"),\"WE\",IF(Mai!$M11=\"\",IF(TYPE(Mai!$I11)=2,\"\",\"-\"),Mai!$M11)),0)","v":"WE"},0,{"$f":"Juni!$A11","v":"Di"},{"$f":"IF(Q4<>0,IF(OR(Q4=\"So\",Q4=\"Sa\"),\"WE\",IF(Juni!$M11=\"\",IF(TYPE(Juni!$I11)=2,\"\",\"-\"),Juni!$M11)),0)","v":""},0,{"$f":"Juli!$A11","v":"Do"},{"$f":"IF(T4<>0,IF(OR(T4=\"So\",T4=\"Sa\"),\"WE\",IF(Juli!$M11=\"\",IF(TYPE(Juli!$I11)=2,\"\",\"-\"),Juli!$M11)),0)","v":""},0,{"$f":"August!$A11","v":"So"},{"$f":"IF(W4<>0,IF(OR(W4=\"So\",W4=\"Sa\"),\"WE\",IF(August!$M11=\"\",IF(TYPE(August!$I11)=2,\"\",\"-\"),August!$M11)),0)","v":"WE"},0,{"$f":"September!$A11","v":"Mi"},{"$f":"IF(Z4<>0,IF(OR(Z4=\"So\",Z4=\"Sa\"),\"WE\",IF(September!$M11=\"\",IF(TYPE(September!$I11)=2,\"\",\"-\"),September!$M11)),0)","v":""},0,{"$f":"Oktober!$A11","v":"Fr"},{"$f":"IF(AC4<>0,IF(OR(AC4=\"So\",AC4=\"Sa\"),\"WE\",IF(Oktober!$M11=\"\",IF(TYPE(Oktober!$I11)=2,\"\",\"-\"),Oktober!$M11)),0)","v":""},0,{"$f":"November!$A11","v":"Mo"},{"$f":"IF(AF4<>0,IF(OR(AF4=\"So\",AF4=\"Sa\"),\"WE\",IF(November!$M11=\"\",IF(TYPE(November!$I11)=2,\"\",\"-\"),November!$M11)),0)","v":""},0,{"$f":"Dezember!$A11","v":"Mi"},{"$f":"IF(AI4<>0,IF(OR(AI4=\"So\",AI4=\"Sa\"),\"WE\",IF(Dezember!$M11=\"\",IF(TYPE(Dezember!$I11)=2,\"\",\"-\"),Dezember!$M11)),0)","v":""},0]
[3,{"$f":"Januar!A12","v":"Sa"},{"$f":"IF(B5<>0,IF(OR(B5=\"So\",B5=\"Sa\"),\"WE\",IF(Januar!$M12=\"\",IF(TYPE(Januar!$I12)=2,\"\",\"-\"),Januar!$M12)),0)","v":"WE"},0,{"$f":"Februar!A12","v":"Di"},{"$f":"IF(E5<>0,IF(OR(E5=\"So\",E5=\"Sa\"),\"WE\",IF(Februar!$M12=\"\",IF(TYPE(Februar!$I12)=2,\"\",\"-\"),Februar!$M12)),0)","v":""},0,{"$f":"März!$A12","v":"Di"},{"$f":"IF(H5<>0,IF(OR(H5=\"So\",H5=\"Sa\"),\"WE\",IF(März!$M12=\"\",IF(TYPE(März!$I12)=2,\"\",\"-\"),März!$M12)),0)","v":""},0,{"$f":"April!$A12","v":"Fr"},{"$f":"IF(K5<>0,IF(OR(K5=\"So\",K5=\"Sa\"),\"WE\",IF(April!$M12=\"\",IF(TYPE(April!$I12)=2,\"\",\"-\"),April!$M12)),0)","v":"FT"},0,{"$f":"Mai!$A12","v":"So"},{"$f":"IF(N5<>0,IF(OR(N5=\"So\",N5=\"Sa\"),\"WE\",IF(Mai!$M12=\"\",IF(TYPE(Mai!$I12)=2,\"\",\"-\"),Mai!$M12)),0)","v":"WE"},0,{"$f":"Juni!$A12","v":"Mi"},{"$f":"IF(Q5<>0,IF(OR(Q5=\"So\",Q5=\"Sa\"),\"WE\",IF(Juni!$M12=\"\",IF(TYPE(Juni!$I12)=2,\"\",\"-\"),Juni!$M12)),0)","v":""},0,{"$f":"Juli!$A12","v":"Fr"},{"$f":"IF(T5<>0,IF(OR(T5=\"So\",T5=\"Sa\"),\"WE\",IF(Juli!$M12=\"\",IF(TYPE(Juli!$I12)=2,\"\",\"-\"),Juli!$M12)),0)","v":""},0,{"$f":"August!$A12","v":"Mo"},{"$f":"IF(W5<>0,IF(OR(W5=\"So\",W5=\"Sa\"),\"WE\",IF(August!$M12=\"\",IF(TYPE(August!$I12)=2,\"\",\"-\"),August!$M12)),0)","v":""},0,{"$f":"September!$A12","v":"Do"},{"$f":"IF(Z5<>0,IF(OR(Z5=\"So\",Z5=\"Sa\"),\"WE\",IF(September!$M12=\"\",IF(TYPE(September!$I12)=2,\"\",\"-\"),September!$M12)),0)","v":""},0,{"$f":"Oktober!$A12","v":"Sa"},{"$f":"IF(AC5<>0,IF(OR(AC5=\"So\",AC5=\"Sa\"),\"WE\",IF(Oktober!$M12=\"\",IF(TYPE(Oktober!$I12)=2,\"\",\"-\"),Oktober!$M12)),0)","v":"WE"},0,{"$f":"November!$A12","v":"Di"},{"$f":"IF(AF5<>0,IF(OR(AF5=\"So\",AF5=\"Sa\"),\"WE\",IF(November!$M12=\"\",IF(TYPE(November!$I12)=2,\"\",\"-\"),November!$M12)),0)","v":""},0,{"$f":"Dezember!$A12","v":"Do"},{"$f":"IF(AI5<>0,IF(OR(AI5=\"So\",AI5=\"Sa\"),\"WE\",IF(Dezember!$M12=\"\",IF(TYPE(Dezember!$I12)=2,\"\",\"-\"),Dezember!$M12)),0)","v":""},0]
[4,{"$f":"Januar!A13","v":"So"},{"$f":"IF(B6<>0,IF(OR(B6=\"So\",B6=\"Sa\"),\"WE\",IF(Januar!$M13=\"\",IF(TYPE(Januar!$I13)=2,\"\",\"-\"),Januar!$M13)),0)","v":"WE"},0,{"$f":"Februar!A13","v":"Mi"},{"$f":"IF(E6<>0,IF(OR(E6=\"So\",E6=\"Sa\"),\"WE\",IF(Februar!$M13=\"\",IF(TYPE(Februar!$I13)=2,\"\",\"-\"),Februar!$M13)),0)","v":""},0,{"$f":"März!$A13","v":"Mi"},{"$f":"IF(H6<>0,IF(OR(H6=\"So\",H6=\"Sa\"),\"WE\",IF(März!$M13=\"\",IF(TYPE(März!$I13)=2,\"\",\"-\"),März!$M13)),0)","v":""},0,{"$f":"April!$A13","v":"Sa"},{"$f":"IF(K6<>0,IF(OR(K6=\"So\",K6=\"Sa\"),\"WE\",IF(April!$M13=\"\",IF(TYPE(April!$I13)=2,\"\",\"-\"),April!$M13)),0)","v":"WE"},0,{"$f":"Mai!$A13","v":"Mo"},{"$f":"IF(N6<>0,IF(OR(N6=\"So\",N6=\"Sa\"),\"WE\",IF(Mai!$M13=\"\",IF(TYPE(Mai!$I13)=2,\"\",\"-\"),Mai!$M13)),0)","v":""},0,{"$f":"Juni!$A13","v":"Do"},{"$f":"IF(Q6<>0,IF(OR(Q6=\"So\",Q6=\"Sa\"),\"WE\",IF(Juni!$M13=\"\",IF(TYPE(Juni!$I13)=2,\"\",\"-\"),Juni!$M13)),0)","v":"FT"},0,{"$f":"Juli!$A13","v":"Sa"},{"$f":"IF(T6<>0,IF(OR(T6=\"So\",T6=\"Sa\"),\"WE\",IF(Juli!$M13=\"\",IF(TYPE(Juli!$I13)=2,\"\",\"-\"),Juli!$M13)),0)","v":"WE"},0,{"$f":"August!$A13","v":"Di"},{"$f":"IF(W6<>0,IF(OR(W6=\"So\",W6=\"Sa\"),\"WE\",IF(August!$M13=\"\",IF(TYPE(August!$I13)=2,\"\",\"-\"),August!$M13)),0)","v":""},0,{"$f":"September!$A13","v":"Fr"},{"$f":"IF(Z6<>0,IF(OR(Z6=\"So\",Z6=\"Sa\"),\"WE\",IF(September!$M13=\"\",IF(TYPE(September!$I13)=2,\"\",\"-\"),September!$M13)),0)","v":""},0,{"$f":"Oktober!$A13","v":"So"},{"$f":"IF(AC6<>0,IF(OR(AC6=\"So\",AC6=\"Sa\"),\"WE\",IF(Oktober!$M13=\"\",IF(TYPE(Oktober!$I13)=2,\"\",\"-\"),Oktober!$M13)),0)","v":"WE"},0,{"$f":"November!$A13","v":"Mi"},{"$f":"IF(AF6<>0,IF(OR(AF6=\"So\",AF6=\"Sa\"),\"WE\",IF(November!$M13=\"\",IF(TYPE(November!$I13)=2,\"\",\"-\"),November!$M13)),0)","v":""},0,{"$f":"Dezember!$A13","v":"Fr"},{"$f":"IF(AI6<>0,IF(OR(AI6=\"So\",AI6=\"Sa\"),\"WE\",IF(Dezember!$M13=\"\",IF(TYPE(Dezember!$I13)=2,\"\",\"-\"),Dezember!$M13)),0)","v":""},0]
[5,{"$f":"Januar!A14","v":"Mo"},{"$f":"IF(B7<>0,IF(OR(B7=\"So\",B7=\"Sa\"),\"WE\",IF(Januar!$M14=\"\",IF(TYPE(Januar!$I14)=2,\"\",\"-\"),Januar!$M14)),0)","v":"U"},0,{"$f":"Februar!A14","v":"Do"},{"$f":"IF(E7<>0,IF(OR(E7=\"So\",E7=\"Sa\"),\"WE\",IF(Februar!$M14=\"\",IF(TYPE(Februar!$I14)=2,\"\",\"-\"),Februar!$M14)),0)","v":""},0,{"$f":"März!$A14","v":"Do"},{"$f":"IF(H7<>0,IF(OR(H7=\"So\",H7=\"Sa\"),\"WE\",IF(März!$M14=\"\",IF(TYPE(März!$I14)=2,\"\",\"-\"),März!$M14)),0)","v":""},0,{"$f":"April!$A14","v":"So"},{"$f":"IF(K7<>0,IF(OR(K7=\"So\",K7=\"Sa\"),\"WE\",IF(April!$M14=\"\",IF(TYPE(April!$I14)=2,\"\",\"-\"),April!$M14)),0)","v":"WE"},0,{"$f":"Mai!$A14","v":"Di"},{"$f":"IF(N7<>0,IF(OR(N7=\"So\",N7=\"Sa\"),\"WE\",IF(Mai!$M14=\"\",IF(TYPE(Mai!$I14)=2,\"\",\"-\"),Mai!$M14)),0)","v":""},0,{"$f":"Juni!$A14","v":"Fr"},{"$f":"IF(Q7<>0,IF(OR(Q7=\"So\",Q7=\"Sa\"),\"WE\",IF(Juni!$M14=\"\",IF(TYPE(Juni!$I14)=2,\"\",\"-\"),Juni!$M14)),0)","v":""},0,{"$f":"Juli!$A14","v":"So"},{"$f":"IF(T7<>0,IF(OR(T7=\"So\",T7=\"Sa\"),\"WE\",IF(Juli!$M14=\"\",IF(TYPE(Juli!$I14)=2,\"\",\"-\"),Juli!$M14)),0)","v":"WE"},0,{"$f":"August!$A14","v":"Mi"},{"$f":"IF(W7<>0,IF(OR(W7=\"So\",W7=\"Sa\"),\"WE\",IF(August!$M14=\"\",IF(TYPE(August!$I14)=2,\"\",\"-\"),August!$M14)),0)","v":""},0,{"$f":"September!$A14","v":"Sa"},{"$f":"IF(Z7<>0,IF(OR(Z7=\"So\",Z7=\"Sa\"),\"WE\",IF(September!$M14=\"\",IF(TYPE(September!$I14)=2,\"\",\"-\"),September!$M14)),0)","v":"WE"},0,{"$f":"Oktober!$A14","v":"Mo"},{"$f":"IF(AC7<>0,IF(OR(AC7=\"So\",AC7=\"Sa\"),\"WE\",IF(Oktober!$M14=\"\",IF(TYPE(Oktober!$I14)=2,\"\",\"-\"),Oktober!$M14)),0)","v":""},0,{"$f":"November!$A14","v":"Do"},{"$f":"IF(AF7<>0,IF(OR(AF7=\"So\",AF7=\"Sa\"),\"WE\",IF(November!$M14=\"\",IF(TYPE(November!$I14)=2,\"\",\"-\"),November!$M14)),0)","v":""},0,{"$f":"Dezember!$A14","v":"Sa"},{"$f":"IF(AI7<>0,IF(OR(AI7=\"So\",AI7=\"Sa\"),\"WE\",IF(Dezember!$M14=\"\",IF(TYPE(Dezember!$I14)=2,\"\",\"-\"),Dezember!$M14)),0)","v":"WE"},0]
[6,{"$f":"Januar!A15","v":"Di"},{"$f":"IF(B8<>0,IF(OR(B8=\"So\",B8=\"Sa\"),\"WE\",IF(Januar!$M15=\"\",IF(TYPE(Januar!$I15)=2,\"\",\"-\"),Januar!$M15)),0)","v":"-"},1,{"$f":"Februar!A15","v":"Fr"},{"$f":"IF(E8<>0,IF(OR(E8=\"So\",E8=\"Sa\"),\"WE\",IF(Februar!$M15=\"\",IF(TYPE(Februar!$I15)=2,\"\",\"-\"),Februar!$M15)),0)","v":""},0,{"$f":"März!$A15","v":"Fr"},{"$f":"IF(H8<>0,IF(OR(H8=\"So\",H8=\"Sa\"),\"WE\",IF(März!$M15=\"\",IF(TYPE(März!$I15)=2,\"\",\"-\"),März!$M15)),0)","v":""},0,{"$f":"April!$A15","v":"Mo"},{"$f":"IF(K8<>0,IF(OR(K8=\"So\",K8=\"Sa\"),\"WE\",IF(April!$M15=\"\",IF(TYPE(April!$I15)=2,\"\",\"-\"),April!$M15)),0)","v":"FT"},0,{"$f":"Mai!$A15","v":"Mi"},{"$f":"IF(N8<>0,IF(OR(N8=\"So\",N8=\"Sa\"),\"WE\",IF(Mai!$M15=\"\",IF(TYPE(Mai!$I15)=2,\"\",\"-\"),Mai!$M15)),0)","v":""},0,{"$f":"Juni!$A15","v":"Sa"},{"$f":"IF(Q8<>0,IF(OR(Q8=\"So\",Q8=\"Sa\"),\"WE\",IF(Juni!$M15=\"\",IF(TYPE(Juni!$I15)=2,\"\",\"-\"),Juni!$M15)),0)","v":"WE"},0,{"$f":"Juli!$A15","v":"Mo"},{"$f":"IF(T8<>0,IF(OR(T8=\"So\",T8=\"Sa\"),\"WE\",IF(Juli!$M15=\"\",IF(TYPE(Juli!$I15)=2,\"\",\"-\"),Juli!$M15)),0)","v":""},0,{"$f":"August!$A15","v":"Do"},{"$f":"IF(W8<>0,IF(OR(W8=\"So\",W8=\"Sa\"),\"WE\",IF(August!$M15=\"\",IF(TYPE(August!$I15)=2,\"\",\"-\"),August!$M15)),0)","v":""},0,{"$f":"September!$A15","v":"So"},{"$f":"IF(Z8<>0,IF(OR(Z8=\"So\",Z8=\"Sa\"),\"WE\",IF(September!$M15=\"\",IF(TYPE(September!$I15)=2,\"\",\"-\"),September!$M15)),0)","v":"WE"},0,{"$f":"Oktober!$A15","v":"Di"},{"$f":"IF(AC8<>0,IF(OR(AC8=\"So\",AC8=\"Sa\"),\"WE\",IF(Oktober!$M15=\"\",IF(TYPE(Oktober!$I15)=2,\"\",\"-\"),Oktober!$M15)),0)","v":""},0,{"$f":"November!$A15","v":"Fr"},{"$f":"IF(AF8<>0,IF(OR(AF8=\"So\",AF8=\"Sa\"),\"WE\",IF(November!$M15=\"\",IF(TYPE(November!$I15)=2,\"\",\"-\"),November!$M15)),0)","v":""},0,{"$f":"Dezember!$A15","v":"So"},{"$f":"IF(AI8<>0,IF(OR(AI8=\"So\",AI8=\"Sa\"),\"WE\",IF(Dezember!$M15=\"\",IF(TYPE(Dezember!$I15)=2,\"\",\"-\"),Dezember!$M15)),0)","v":"WE"},0]
[7,{"$f":"Januar!A16","v":"Mi"},{"$f":"IF(B9<>0,IF(OR(B9=\"So\",B9=\"Sa\"),\"WE\",IF(Januar!$M16=\"\",IF(TYPE(Januar!$I16)=2,\"\",\"-\"),Januar!$M16)),0)","v":"-"},1,{"$f":"Februar!A16","v":"Sa"},{"$f":"IF(E9<>0,IF(OR(E9=\"So\",E9=\"Sa\"),\"WE\",IF(Februar!$M16=\"\",IF(TYPE(Februar!$I16)=2,\"\",\"-\"),Februar!$M16)),0)","v":"WE"},0,{"$f":"März!$A16","v":"Sa"},{"$f":"IF(H9<>0,IF(OR(H9=\"So\",H9=\"Sa\"),\"WE\",IF(März!$M16=\"\",IF(TYPE(März!$I16)=2,\"\",\"-\"),März!$M16)),0)","v":"WE"},0,{"$f":"April!$A16","v":"Di"},{"$f":"IF(K9<>0,IF(OR(K9=\"So\",K9=\"Sa\"),\"WE\",IF(April!$M16=\"\",IF(TYPE(April!$I16)=2,\"\",\"-\"),April!$M16)),0)","v":""},0,{"$f":"Mai!$A16","v":"Do"},{"$f":"IF(N9<>0,IF(OR(N9=\"So\",N9=\"Sa\"),\"WE\",IF(Mai!$M16=\"\",IF(TYPE(Mai!$I16)=2,\"\",\"-\"),Mai!$M16)),0)","v":""},0,{"$f":"Juni!$A16","v":"So"},{"$f":"IF(Q9<>0,IF(OR(Q9=\"So\",Q9=\"Sa\"),\"WE\",IF(Juni!$M16=\"\",IF(TYPE(Juni!$I16)=2,\"\",\"-\"),Juni!$M16)),0)","v":"WE"},0,{"$f":"Juli!$A16","v":"Di"},{"$f":"IF(T9<>0,IF(OR(T9=\"So\",T9=\"Sa\"),\"WE\",IF(Juli!$M16=\"\",IF(TYPE(Juli!$I16)=2,\"\",\"-\"),Juli!$M16)),0)","v":""},0,{"$f":"August!$A16","v":"Fr"},{"$f":"IF(W9<>0,IF(OR(W9=\"So\",W9=\"Sa\"),\"WE\",IF(August!$M16=\"\",IF(TYPE(August!$I16)=2,\"\",\"-\"),August!$M16)),0)","v":""},0,{"$f":"September!$A16","v":"Mo"},{"$f":"IF(Z9<>0,IF(OR(Z9=\"So\",Z9=\"Sa\"),\"WE\",IF(September!$M16=\"\",IF(TYPE(September!$I16)=2,\"\",\"-\"),September!$M16)),0)","v":""},0,{"$f":"Oktober!$A16","v":"Mi"},{"$f":"IF(AC9<>0,IF(OR(AC9=\"So\",AC9=\"Sa\"),\"WE\",IF(Oktober!$M16=\"\",IF(TYPE(Oktober!$I16)=2,\"\",\"-\"),Oktober!$M16)),0)","v":""},0,{"$f":"November!$A16","v":"Sa"},{"$f":"IF(AF9<>0,IF(OR(AF9=\"So\",AF9=\"Sa\"),\"WE\",IF(November!$M16=\"\",IF(TYPE(November!$I16)=2,\"\",\"-\"),November!$M16)),0)","v":"WE"},0,{"$f":"Dezember!$A16","v":"Mo"},{"$f":"IF(AI9<>0,IF(OR(AI9=\"So\",AI9=\"Sa\"),\"WE\",IF(Dezember!$M16=\"\",IF(TYPE(Dezember!$I16)=2,\"\",\"-\"),Dezember!$M16)),0)","v":""},0]
[8,{"$f":"Januar!A17","v":"Do"},{"$f":"IF(B10<>0,IF(OR(B10=\"So\",B10=\"Sa\"),\"WE\",IF(Januar!$M17=\"\",IF(TYPE(Januar!$I17)=2,\"\",\"-\"),Januar!$M17)),0)","v":"-"},1,{"$f":"Februar!A17","v":"So"},{"$f":"IF(E10<>0,IF(OR(E10=\"So\",E10=\"Sa\"),\"WE\",IF(Februar!$M17=\"\",IF(TYPE(Februar!$I17)=2,\"\",\"-\"),Februar!$M17)),0)","v":"WE"},0,{"$f":"März!$A17","v":"So"},{"$f":"IF(H10<>0,IF(OR(H10=\"So\",H10=\"Sa\"),\"WE\",IF(März!$M17=\"\",IF(TYPE(März!$I17)=2,\"\",\"-\"),März!$M17)),0)","v":"WE"},0,{"$f":"April!$A17","v":"Mi"},{"$f":"IF(K10<>0,IF(OR(K10=\"So\",K10=\"Sa\"),\"WE\",IF(April!$M17=\"\",IF(TYPE(April!$I17)=2,\"\",\"-\"),April!$M17)),0)","v":""},0,{"$f":"Mai!$A17","v":"Fr"},{"$f":"IF(N10<>0,IF(OR(N10=\"So\",N10=\"Sa\"),\"WE\",IF(Mai!$M17=\"\",IF(TYPE(Mai!$I17)=2,\"\",\"-\"),Mai!$M17)),0)","v":""},0,{"$f":"Juni!$A17","v":"Mo"},{"$f":"IF(Q10<>0,IF(OR(Q10=\"So\",Q10=\"Sa\"),\"WE\",IF(Juni!$M17=\"\",IF(TYPE(Juni!$I17)=2,\"\",\"-\"),Juni!$M17)),0)","v":""},0,{"$f":"Juli!$A17","v":"Mi"},{"$f":"IF(T10<>0,IF(OR(T10=\"So\",T10=\"Sa\"),\"WE\",IF(Juli!$M17=\"\",IF(TYPE(Juli!$I17)=2,\"\",\"-\"),Juli!$M17)),0)","v":""},0,{"$f":"August!$A17","v":"Sa"},{"$f":"IF(W10<>0,IF(OR(W10=\"So\",W10=\"Sa\"),\"WE\",IF(August!$M17=\"\",IF(TYPE(August!$I17)=2,\"\",\"-\"),August!$M17)),0)","v":"WE"},0,{"$f":"September!$A17","v":"Di"},{"$f":"IF(Z10<>0,IF(OR(Z10=\"So\",Z10=\"Sa\"),\"WE\",IF(September!$M17=\"\",IF(TYPE(September!$I17)=2,\"\",\"-\"),September!$M17)),0)","v":""},0,{"$f":"Oktober!$A17","v":"Do"},{"$f":"IF(AC10<>0,IF(OR(AC10=\"So\",AC10=\"Sa\"),\"WE\",IF(Oktober!$M17=\"\",IF(TYPE(Oktober!$I17)=2,\"\",\"-\"),Oktober!$M17)),0)","v":""},0,{"$f":"November!$A17","v":"So"},{"$f":"IF(AF10<>0,IF(OR(AF10=\"So\",AF10=\"Sa\"),\"WE\",IF(November!$M17=\"\",IF(TYPE(November!$I17)=2,\"\",\"-\"),November!$M17)),0)","v":"WE"},0,{"$f":"Dezember!$A17","v":"Di"},{"$f":"IF(AI10<>0,IF(OR(AI10=\"So\",AI10=\"Sa\"),\"WE\",IF(Dezember!$M17=\"\",IF(TYPE(Dezember!$I17)=2,\"\",\"-\"),Dezember!$M17)),0)","v":""},0]
[9,{"$f":"Januar!A18","v":"Fr"},{"$f":"IF(B11<>0,IF(OR(B11=\"So\",B11=\"Sa\"),\"WE\",IF(Januar!$M18=\"\",IF(TYPE(Januar!$I18)=2,\"\",\"-\"),Januar!$M18)),0)","v":""},0,{"$f":"Februar!A18","v":"Mo"},{"$f":"IF(E11<>0,IF(OR(E11=\"So\",E11=\"Sa\"),\"WE\",IF(Februar!$M18=\"\",IF(TYPE(Februar!$I18)=2,\"\",\"-\"),Februar!$M18)),0)","v":""},0,{"$f":"März!$A18","v":"Mo"},{"$f":"IF(H11<>0,IF(OR(H11=\"So\",H11=\"Sa\"),\"WE\",IF(März!$M18=\"\",IF(TYPE(März!$I18)=2,\"\",\"-\"),März!$M18)),0)","v":""},0,{"$f":"April!$A18","v":"Do"},{"$f":"IF(K11<>0,IF(OR(K11=\"So\",K11=\"Sa\"),\"WE\",IF(April!$M18=\"\",IF(TYPE(April!$I18)=2,\"\",\"-\"),April!$M18)),0)","v":""},0,{"$f":"Mai!$A18","v":"Sa"},{"$f":"IF(N11<>0,IF(OR(N11=\"So\",N11=\"Sa\"),\"WE\",IF(Mai!$M18=\"\",IF(TYPE(Mai!$I18)=2,\"\",\"-\"),Mai!$M18)),0)","v":"WE"},0,{"$f":"Juni!$A18","v":"Di"},{"$f":"IF(Q11<>0,IF(OR(Q11=\"So\",Q11=\"Sa\"),\"WE\",IF(Juni!$M18=\"\",IF(TYPE(Juni!$I18)=2,\"\",\"-\"),Juni!$M18)),0)","v":""},0,{"$f":"Juli!$A18","v":"Do"},{"$f":"IF(T11<>0,IF(OR(T11=\"So\",T11=\"Sa\"),\"WE\",IF(Juli!$M18=\"\",IF(TYPE(Juli!$I18)=2,\"\",\"-\"),Juli!$M18)),0)","v":""},0,{"$f":"August!$A18","v":"So"},{"$f":"IF(W11<>0,IF(OR(W11=\"So\",W11=\"Sa\"),\"WE\",IF(August!$M18=\"\",IF(TYPE(August!$I18)=2,\"\",\"-\"),August!$M18)),0)","v":"WE"},0,{"$f":"September!$A18","v":"Mi"},{"$f":"IF(Z11<>0,IF(OR(Z11=\"So\",Z11=\"Sa\"),\"WE\",IF(September!$M18=\"\",IF(TYPE(September!$I18)=2,\"\",\"-\"),September!$M18)),0)","v":""},0,{"$f":"Oktober!$A18","v":"Fr"},{"$f":"IF(AC11<>0,IF(OR(AC11=\"So\",AC11=\"Sa\"),\"WE\",IF(Oktober!$M18=\"\",IF(TYPE(Oktober!$I18)=2,\"\",\"-\"),Oktober!$M18)),0)","v":""},0,{"$f":"November!$A18","v":"Mo"},{"$f":"IF(AF11<>0,IF(OR(AF11=\"So\",AF11=\"Sa\"),\"WE\",IF(November!$M18=\"\",IF(TYPE(November!$I18)=2,\"\",\"-\"),November!$M18)),0)","v":""},0,{"$f":"Dezember!$A18","v":"Mi"},{"$f":"IF(AI11<>0,IF(OR(AI11=\"So\",AI11=\"Sa\"),\"WE\",IF(Dezember!$M18=\"\",IF(TYPE(Dezember!$I18)=2,\"\",\"-\"),Dezember!$M18)),0)","v":""},0]
[10,{"$f":"Januar!A19","v":"Sa"},{"$f":"IF(B12<>0,IF(OR(B12=\"So\",B12=\"Sa\"),\"WE\",IF(Januar!$M19=\"\",IF(TYPE(Januar!$I19)=2,\"\",\"-\"),Januar!$M19)),0)","v":"WE"},0,{"$f":"Februar!A19","v":"Di"},{"$f":"IF(E12<>0,IF(OR(E12=\"So\",E12=\"Sa\"),\"WE\",IF(Februar!$M19=\"\",IF(TYPE(Februar!$I19)=2,\"\",\"-\"),Februar!$M19)),0)","v":""},0,{"$f":"März!$A19","v":"Di"},{"$f":"IF(H12<>0,IF(OR(H12=\"So\",H12=\"Sa\"),\"WE\",IF(März!$M19=\"\",IF(TYPE(März!$I19)=2,\"\",\"-\"),März!$M19)),0)","v":""},0,{"$f":"April!$A19","v":"Fr"},{"$f":"IF(K12<>0,IF(OR(K12=\"So\",K12=\"Sa\"),\"WE\",IF(April!$M19=\"\",IF(TYPE(April!$I19)=2,\"\",\"-\"),April!$M19)),0)","v":""},0,{"$f":"Mai!$A19","v":"So"},{"$f":"IF(N12<>0,IF(OR(N12=\"So\",N12=\"Sa\"),\"WE\",IF(Mai!$M19=\"\",IF(TYPE(Mai!$I19)=2,\"\",\"-\"),Mai!$M19)),0)","v":"WE"},0,{"$f":"Juni!$A19","v":"Mi"},{"$f":"IF(Q12<>0,IF(OR(Q12=\"So\",Q12=\"Sa\"),\"WE\",IF(Juni!$M19=\"\",IF(TYPE(Juni!$I19)=2,\"\",\"-\"),Juni!$M19)),0)","v":""},0,{"$f":"Juli!$A19","v":"Fr"},{"$f":"IF(T12<>0,IF(OR(T12=\"So\",T12=\"Sa\"),\"WE\",IF(Juli!$M19=\"\",IF(TYPE(Juli!$I19)=2,\"\",\"-\"),Juli!$M19)),0)","v":""},0,{"$f":"August!$A19","v":"Mo"},{"$f":"IF(W12<>0,IF(OR(W12=\"So\",W12=\"Sa\"),\"WE\",IF(August!$M19=\"\",IF(TYPE(August!$I19)=2,\"\",\"-\"),August!$M19)),0)","v":""},0,{"$f":"September!$A19","v":"Do"},{"$f":"IF(Z12<>0,IF(OR(Z12=\"So\",Z12=\"Sa\"),\"WE\",IF(September!$M19=\"\",IF(TYPE(September!$I19)=2,\"\",\"-\"),September!$M19)),0)","v":""},0,{"$f":"Oktober!$A19","v":"Sa"},{"$f":"IF(AC12<>0,IF(OR(AC12=\"So\",AC12=\"Sa\"),\"WE\",IF(Oktober!$M19=\"\",IF(TYPE(Oktober!$I19)=2,\"\",\"-\"),Oktober!$M19)),0)","v":"WE"},0,{"$f":"November!$A19","v":"Di"},{"$f":"IF(AF12<>0,IF(OR(AF12=\"So\",AF12=\"Sa\"),\"WE\",IF(November!$M19=\"\",IF(TYPE(November!$I19)=2,\"\",\"-\"),November!$M19)),0)","v":""},0,{"$f":"Dezember!$A19","v":"Do"},{"$f":"IF(AI12<>0,IF(OR(AI12=\"So\",AI12=\"Sa\"),\"WE\",IF(Dezember!$M19=\"\",IF(TYPE(Dezember!$I19)=2,\"\",\"-\"),Dezember!$M19)),0)","v":""},0]
[11,{"$f":"Januar!A20","v":"So"},{"$f":"IF(B13<>0,IF(OR(B13=\"So\",B13=\"Sa\"),\"WE\",IF(Januar!$M20=\"\",IF(TYPE(Januar!$I20)=2,\"\",\"-\"),Januar!$M20)),0)","v":"WE"},0,{"$f":"Februar!A20","v":"Mi"},{"$f":"IF(E13<>0,IF(OR(E13=\"So\",E13=\"Sa\"),\"WE\",IF(Februar!$M20=\"\",IF(TYPE(Februar!$I20)=2,\"\",\"-\"),Februar!$M20)),0)","v":""},0,{"$f":"März!$A20","v":"Mi"},{"$f":"IF(H13<>0,IF(OR(H13=\"So\",H13=\"Sa\"),\"WE\",IF(März!$M20=\"\",IF(TYPE(März!$I20)=2,\"\",\"-\"),März!$M20)),0)","v":""},0,{"$f":"April!$A20","v":"Sa"},{"$f":"IF(K13<>0,IF(OR(K13=\"So\",K13=\"Sa\"),\"WE\",IF(April!$M20=\"\",IF(TYPE(April!$I20)=2,\"\",\"-\"),April!$M20)),0)","v":"WE"},0,{"$f":"Mai!$A20","v":"Mo"},{"$f":"IF(N13<>0,IF(OR(N13=\"So\",N13=\"Sa\"),\"WE\",IF(Mai!$M20=\"\",IF(TYPE(Mai!$I20)=2,\"\",\"-\"),Mai!$M20)),0)","v":""},0,{"$f":"Juni!$A20","v":"Do"},{"$f":"IF(Q13<>0,IF(OR(Q13=\"So\",Q13=\"Sa\"),\"WE\",IF(Juni!$M20=\"\",IF(TYPE(Juni!$I20)=2,\"\",\"-\"),Juni!$M20)),0)","v":""},0,{"$f":"Juli!$A20","v":"Sa"},{"$f":"IF(T13<>0,IF(OR(T13=\"So\",T13=\"Sa\"),\"WE\",IF(Juli!$M20=\"\",IF(TYPE(Juli!$I20)=2,\"\",\"-\"),Juli!$M20)),0)","v":"WE"},0,{"$f":"August!$A20","v":"Di"},{"$f":"IF(W13<>0,IF(OR(W13=\"So\",W13=\"Sa\"),\"WE\",IF(August!$M20=\"\",IF(TYPE(August!$I20)=2,\"\",\"-\"),August!$M20)),0)","v":""},0,{"$f":"September!$A20","v":"Fr"},{"$f":"IF(Z13<>0,IF(OR(Z13=\"So\",Z13=\"Sa\"),\"WE\",IF(September!$M20=\"\",IF(TYPE(September!$I20)=2,\"\",\"-\"),September!$M20)),0)","v":""},0,{"$f":"Oktober!$A20","v":"So"},{"$f":"IF(AC13<>0,IF(OR(AC13=\"So\",AC13=\"Sa\"),\"WE\",IF(Oktober!$M20=\"\",IF(TYPE(Oktober!$I20)=2,\"\",\"-\"),Oktober!$M20)),0)","v":"WE"},0,{"$f":"November!$A20","v":"Mi"},{"$f":"IF(AF13<>0,IF(OR(AF13=\"So\",AF13=\"Sa\"),\"WE\",IF(November!$M20=\"\",IF(TYPE(November!$I20)=2,\"\",\"-\"),November!$M20)),0)","v":""},0,{"$f":"Dezember!$A20","v":"Fr"},{"$f":"IF(AI13<>0,IF(OR(AI13=\"So\",AI13=\"Sa\"),\"WE\",IF(Dezember!$M20=\"\",IF(TYPE(Dezember!$I20)=2,\"\",\"-\"),Dezember!$M20)),0)","v":""},0]
[12,{"$f":"Januar!A21","v":"Mo"},{"$f":"IF(B14<>0,IF(OR(B14=\"So\",B14=\"Sa\"),\"WE\",IF(Januar!$M21=\"\",IF(TYPE(Januar!$I21)=2,\"\",\"-\"),Januar!$M21)),0)","v":""},0,{"$f":"Februar!A21","v":"Do"},{"$f":"IF(E14<>0,IF(OR(E14=\"So\",E14=\"Sa\"),\"WE\",IF(Februar!$M21=\"\",IF(TYPE(Februar!$I21)=2,\"\",\"-\"),Februar!$M21)),0)","v":""},0,{"$f":"März!$A21","v":"Do"},{"$f":"IF(H14<>0,IF(OR(H14=\"So\",H14=\"Sa\"),\"WE\",IF(März!$M21=\"\",IF(TYPE(März!$I21)=2,\"\",\"-\"),März!$M21)),0)","v":""},0,{"$f":"April!$A21","v":"So"},{"$f":"IF(K14<>0,IF(OR(K14=\"So\",K14=\"Sa\"),\"WE\",IF(April!$M21=\"\",IF(TYPE(April!$I21)=2,\"\",\"-\"),April!$M21)),0)","v":"WE"},0,{"$f":"Mai!$A21","v":"Di"},{"$f":"IF(N14<>0,IF(OR(N14=\"So\",N14=\"Sa\"),\"WE\",IF(Mai!$M21=\"\",IF(TYPE(Mai!$I21)=2,\"\",\"-\"),Mai!$M21)),0)","v":""},0,{"$f":"Juni!$A21","v":"Fr"},{"$f":"IF(Q14<>0,IF(OR(Q14=\"So\",Q14=\"Sa\"),\"WE\",IF(Juni!$M21=\"\",IF(TYPE(Juni!$I21)=2,\"\",\"-\"),Juni!$M21)),0)","v":""},0,{"$f":"Juli!$A21","v":"So"},{"$f":"IF(T14<>0,IF(OR(T14=\"So\",T14=\"Sa\"),\"WE\",IF(Juli!$M21=\"\",IF(TYPE(Juli!$I21)=2,\"\",\"-\"),Juli!$M21)),0)","v":"WE"},0,{"$f":"August!$A21","v":"Mi"},{"$f":"IF(W14<>0,IF(OR(W14=\"So\",W14=\"Sa\"),\"WE\",IF(August!$M21=\"\",IF(TYPE(August!$I21)=2,\"\",\"-\"),August!$M21)),0)","v":""},0,{"$f":"September!$A21","v":"Sa"},{"$f":"IF(Z14<>0,IF(OR(Z14=\"So\",Z14=\"Sa\"),\"WE\",IF(September!$M21=\"\",IF(TYPE(September!$I21)=2,\"\",\"-\"),September!$M21)),0)","v":"WE"},0,{"$f":"Oktober!$A21","v":"Mo"},{"$f":"IF(AC14<>0,IF(OR(AC14=\"So\",AC14=\"Sa\"),\"WE\",IF(Oktober!$M21=\"\",IF(TYPE(Oktober!$I21)=2,\"\",\"-\"),Oktober!$M21)),0)","v":""},0,{"$f":"November!$A21","v":"Do"},{"$f":"IF(AF14<>0,IF(OR(AF14=\"So\",AF14=\"Sa\"),\"WE\",IF(November!$M21=\"\",IF(TYPE(November!$I21)=2,\"\",\"-\"),November!$M21)),0)","v":""},0,{"$f":"Dezember!$A21","v":"Sa"},{"$f":"IF(AI14<>0,IF(OR(AI14=\"So\",AI14=\"Sa\"),\"WE\",IF(Dezember!$M21=\"\",IF(TYPE(Dezember!$I21)=2,\"\",\"-\"),Dezember!$M21)),0)","v":"WE"},0]
[13,{"$f":"Januar!A22","v":"Di"},{"$f":"IF(B15<>0,IF(OR(B15=\"So\",B15=\"Sa\"),\"WE\",IF(Januar!$M22=\"\",IF(TYPE(Januar!$I22)=2,\"\",\"-\"),Januar!$M22)),0)","v":""},0,{"$f":"Februar!A22","v":"Fr"},{"$f":"IF(E15<>0,IF(OR(E15=\"So\",E15=\"Sa\"),\"WE\",IF(Februar!$M22=\"\",IF(TYPE(Februar!$I22)=2,\"\",\"-\"),Februar!$M22)),0)","v":""},0,{"$f":"März!$A22","v":"Fr"},{"$f":"IF(H15<>0,IF(OR(H15=\"So\",H15=\"Sa\"),\"WE\",IF(März!$M22=\"\",IF(TYPE(März!$I22)=2,\"\",\"-\"),März!$M22)),0)","v":""},0,{"$f":"April!$A22","v":"Mo"},{"$f":"IF(K15<>0,IF(OR(K15=\"So\",K15=\"Sa\"),\"WE\",IF(April!$M22=\"\",IF(TYPE(April!$I22)=2,\"\",\"-\"),April!$M22)),0)","v":""},0,{"$f":"Mai!$A22","v":"Mi"},{"$f":"IF(N15<>0,IF(OR(N15=\"So\",N15=\"Sa\"),\"WE\",IF(Mai!$M22=\"\",IF(TYPE(Mai!$I22)=2,\"\",\"-\"),Mai!$M22)),0)","v":""},0,{"$f":"Juni!$A22","v":"Sa"},{"$f":"IF(Q15<>0,IF(OR(Q15=\"So\",Q15=\"Sa\"),\"WE\",IF(Juni!$M22=\"\",IF(TYPE(Juni!$I22)=2,\"\",\"-\"),Juni!$M22)),0)","v":"WE"},0,{"$f":"Juli!$A22","v":"Mo"},{"$f":"IF(T15<>0,IF(OR(T15=\"So\",T15=\"Sa\"),\"WE\",IF(Juli!$M22=\"\",IF(TYPE(Juli!$I22)=2,\"\",\"-\"),Juli!$M22)),0)","v":""},0,{"$f":"August!$A22","v":"Do"},{"$f":"IF(W15<>0,IF(OR(W15=\"So\",W15=\"Sa\"),\"WE\",IF(August!$M22=\"\",IF(TYPE(August!$I22)=2,\"\",\"-\"),August!$M22)),0)","v":""},0,{"$f":"September!$A22","v":"So"},{"$f":"IF(Z15<>0,IF(OR(Z15=\"So\",Z15=\"Sa\"),\"WE\",IF(September!$M22=\"\",IF(TYPE(September!$I22)=2,\"\",\"-\"),September!$M22)),0)","v":"WE"},0,{"$f":"Oktober!$A22","v":"Di"},{"$f":"IF(AC15<>0,IF(OR(AC15=\"So\",AC15=\"Sa\"),\"WE\",IF(Oktober!$M22=\"\",IF(TYPE(Oktober!$I22)=2,\"\",\"-\"),Oktober!$M22)),0)","v":""},0,{"$f":"November!$A22","v":"Fr"},{"$f":"IF(AF15<>0,IF(OR(AF15=\"So\",AF15=\"Sa\"),\"WE\",IF(November!$M22=\"\",IF(TYPE(November!$I22)=2,\"\",\"-\"),November!$M22)),0)","v":""},0,{"$f":"Dezember!$A22","v":"So"},{"$f":"IF(AI15<>0,IF(OR(AI15=\"So\",AI15=\"Sa\"),\"WE\",IF(Dezember!$M22=\"\",IF(TYPE(Dezember!$I22)=2,\"\",\"-\"),Dezember!$M22)),0)","v":"WE"},0]
[14,{"$f":"Januar!A23","v":"Mi"},{"$f":"IF(B16<>0,IF(OR(B16=\"So\",B16=\"Sa\"),\"WE\",IF(Januar!$M23=\"\",IF(TYPE(Januar!$I23)=2,\"\",\"-\"),Januar!$M23)),0)","v":""},0,{"$f":"Februar!A23","v":"Sa"},{"$f":"IF(E16<>0,IF(OR(E16=\"So\",E16=\"Sa\"),\"WE\",IF(Februar!$M23=\"\",IF(TYPE(Februar!$I23)=2,\"\",\"-\"),Februar!$M23)),0)","v":"WE"},0,{"$f":"März!$A23","v":"Sa"},{"$f":"IF(H16<>0,IF(OR(H16=\"So\",H16=\"Sa\"),\"WE\",IF(März!$M23=\"\",IF(TYPE(März!$I23)=2,\"\",\"-\"),März!$M23)),0)","v":"WE"},0,{"$f":"April!$A23","v":"Di"},{"$f":"IF(K16<>0,IF(OR(K16=\"So\",K16=\"Sa\"),\"WE\",IF(April!$M23=\"\",IF(TYPE(April!$I23)=2,\"\",\"-\"),April!$M23)),0)","v":""},0,{"$f":"Mai!$A23","v":"Do"},{"$f":"IF(N16<>0,IF(OR(N16=\"So\",N16=\"Sa\"),\"WE\",IF(Mai!$M23=\"\",IF(TYPE(Mai!$I23)=2,\"\",\"-\"),Mai!$M23)),0)","v":"FT"},0,{"$f":"Juni!$A23","v":"So"},{"$f":"IF(Q16<>0,IF(OR(Q16=\"So\",Q16=\"Sa\"),\"WE\",IF(Juni!$M23=\"\",IF(TYPE(Juni!$I23)=2,\"\",\"-\"),Juni!$M23)),0)","v":"WE"},0,{"$f":"Juli!$A23","v":"Di"},{"$f":"IF(T16<>0,IF(OR(T16=\"So\",T16=\"Sa\"),\"WE\",IF(Juli!$M23=\"\",IF(TYPE(Juli!$I23)=2,\"\",\"-\"),Juli!$M23)),0)","v":""},0,{"$f":"August!$A23","v":"Fr"},{"$f":"IF(W16<>0,IF(OR(W16=\"So\",W16=\"Sa\"),\"WE\",IF(August!$M23=\"\",IF(TYPE(August!$I23)=2,\"\",\"-\"),August!$M23)),0)","v":""},0,{"$f":"September!$A23","v":"Mo"},{"$f":"IF(Z16<>0,IF(OR(Z16=\"So\",Z16=\"Sa\"),\"WE\",IF(September!$M23=\"\",IF(TYPE(September!$I23)=2,\"\",\"-\"),September!$M23)),0)","v":""},0,{"$f":"Oktober!$A23","v":"Mi"},{"$f":"IF(AC16<>0,IF(OR(AC16=\"So\",AC16=\"Sa\"),\"WE\",IF(Oktober!$M23=\"\",IF(TYPE(Oktober!$I23)=2,\"\",\"-\"),Oktober!$M23)),0)","v":""},0,{"$f":"November!$A23","v":"Sa"},{"$f":"IF(AF16<>0,IF(OR(AF16=\"So\",AF16=\"Sa\"),\"WE\",IF(November!$M23=\"\",IF(TYPE(November!$I23)=2,\"\",\"-\"),November!$M23)),0)","v":"WE"},0,{"$f":"Dezember!$A23","v":"Mo"},{"$f":"IF(AI16<>0,IF(OR(AI16=\"So\",AI16=\"Sa\"),\"WE\",IF(Dezember!$M23=\"\",IF(TYPE(Dezember!$I23)=2,\"\",\"-\"),Dezember!$M23)),0)","v":""},0]
[15,{"$f":"Januar!A24","v":"Do"},{"$f":"IF(B17<>0,IF(OR(B17=\"So\",B17=\"Sa\"),\"WE\",IF(Januar!$M24=\"\",IF(TYPE(Januar!$I24)=2,\"\",\"-\"),Januar!$M24)),0)","v":""},0,{"$f":"Februar!A24","v":"So"},{"$f":"IF(E17<>0,IF(OR(E17=\"So\",E17=\"Sa\"),\"WE\",IF(Februar!$M24=\"\",IF(TYPE(Februar!$I24)=2,\"\",\"-\"),Februar!$M24)),0)","v":"WE"},0,{"$f":"März!$A24","v":"So"},{"$f":"IF(H17<>0,IF(OR(H17=\"So\",H17=\"Sa\"),\"WE\",IF(März!$M24=\"\",IF(TYPE(März!$I24)=2,\"\",\"-\"),März!$M24)),0)","v":"WE"},0,{"$f":"April!$A24","v":"Mi"},{"$f":"IF(K17<>0,IF(OR(K17=\"So\",K17=\"Sa\"),\"WE\",IF(April!$M24=\"\",IF(TYPE(April!$I24)=2,\"\",\"-\"),April!$M24)),0)","v":""},0,{"$f":"Mai!$A24","v":"Fr"},{"$f":"IF(N17<>0,IF(OR(N17=\"So\",N17=\"Sa\"),\"WE\",IF(Mai!$M24=\"\",IF(TYPE(Mai!$I24)=2,\"\",\"-\"),Mai!$M24)),0)","v":""},0,{"$f":"Juni!$A24","v":"Mo"},{"$f":"IF(Q17<>0,IF(OR(Q17=\"So\",Q17=\"Sa\"),\"WE\",IF(Juni!$M24=\"\",IF(TYPE(Juni!$I24)=2,\"\",\"-\"),Juni!$M24)),0)","v":""},0,{"$f":"Juli!$A24","v":"Mi"},{"$f":"IF(T17<>0,IF(OR(T17=\"So\",T17=\"Sa\"),\"WE\",IF(Juli!$M24=\"\",IF(TYPE(Juli!$I24)=2,\"\",\"-\"),Juli!$M24)),0)","v":""},0,{"$f":"August!$A24","v":"Sa"},{"$f":"IF(W17<>0,IF(OR(W17=\"So\",W17=\"Sa\"),\"WE\",IF(August!$M24=\"\",IF(TYPE(August!$I24)=2,\"\",\"-\"),August!$M24)),0)","v":"WE"},0,{"$f":"September!$A24","v":"Di"},{"$f":"IF(Z17<>0,IF(OR(Z17=\"So\",Z17=\"Sa\"),\"WE\",IF(September!$M24=\"\",IF(TYPE(September!$I24)=2,\"\",\"-\"),September!$M24)),0)","v":""},0,{"$f":"Oktober!$A24","v":"Do"},{"$f":"IF(AC17<>0,IF(OR(AC17=\"So\",AC17=\"Sa\"),\"WE\",IF(Oktober!$M24=\"\",IF(TYPE(Oktober!$I24)=2,\"\",\"-\"),Oktober!$M24)),0)","v":""},0,{"$f":"November!$A24","v":"So"},{"$f":"IF(AF17<>0,IF(OR(AF17=\"So\",AF17=\"Sa\"),\"WE\",IF(November!$M24=\"\",IF(TYPE(November!$I24)=2,\"\",\"-\"),November!$M24)),0)","v":"WE"},0,{"$f":"Dezember!$A24","v":"Di"},{"$f":"IF(AI17<>0,IF(OR(AI17=\"So\",AI17=\"Sa\"),\"WE\",IF(Dezember!$M24=\"\",IF(TYPE(Dezember!$I24)=2,\"\",\"-\"),Dezember!$M24)),0)","v":""},0]
[16,{"$f":"Januar!A25","v":"Fr"},{"$f":"IF(B18<>0,IF(OR(B18=\"So\",B18=\"Sa\"),\"WE\",IF(Januar!$M25=\"\",IF(TYPE(Januar!$I25)=2,\"\",\"-\"),Januar!$M25)),0)","v":""},0,{"$f":"Februar!A25","v":"Mo"},{"$f":"IF(E18<>0,IF(OR(E18=\"So\",E18=\"Sa\"),\"WE\",IF(Februar!$M25=\"\",IF(TYPE(Februar!$I25)=2,\"\",\"-\"),Februar!$M25)),0)","v":""},0,{"$f":"März!$A25","v":"Mo"},{"$f":"IF(H18<>0,IF(OR(H18=\"So\",H18=\"Sa\"),\"WE\",IF(März!$M25=\"\",IF(TYPE(März!$I25)=2,\"\",\"-\"),März!$M25)),0)","v":""},0,{"$f":"April!$A25","v":"Do"},{"$f":"IF(K18<>0,IF(OR(K18=\"So\",K18=\"Sa\"),\"WE\",IF(April!$M25=\"\",IF(TYPE(April!$I25)=2,\"\",\"-\"),April!$M25)),0)","v":""},0,{"$f":"Mai!$A25","v":"Sa"},{"$f":"IF(N18<>0,IF(OR(N18=\"So\",N18=\"Sa\"),\"WE\",IF(Mai!$M25=\"\",IF(TYPE(Mai!$I25)=2,\"\",\"-\"),Mai!$M25)),0)","v":"WE"},0,{"$f":"Juni!$A25","v":"Di"},{"$f":"IF(Q18<>0,IF(OR(Q18=\"So\",Q18=\"Sa\"),\"WE\",IF(Juni!$M25=\"\",IF(TYPE(Juni!$I25)=2,\"\",\"-\"),Juni!$M25)),0)","v":""},0,{"$f":"Juli!$A25","v":"Do"},{"$f":"IF(T18<>0,IF(OR(T18=\"So\",T18=\"Sa\"),\"WE\",IF(Juli!$M25=\"\",IF(TYPE(Juli!$I25)=2,\"\",\"-\"),Juli!$M25)),0)","v":""},0,{"$f":"August!$A25","v":"So"},{"$f":"IF(W18<>0,IF(OR(W18=\"So\",W18=\"Sa\"),\"WE\",IF(August!$M25=\"\",IF(TYPE(August!$I25)=2,\"\",\"-\"),August!$M25)),0)","v":"WE"},0,{"$f":"September!$A25","v":"Mi"},{"$f":"IF(Z18<>0,IF(OR(Z18=\"So\",Z18=\"Sa\"),\"WE\",IF(September!$M25=\"\",IF(TYPE(September!$I25)=2,\"\",\"-\"),September!$M25)),0)","v":""},0,{"$f":"Oktober!$A25","v":"Fr"},{"$f":"IF(AC18<>0,IF(OR(AC18=\"So\",AC18=\"Sa\"),\"WE\",IF(Oktober!$M25=\"\",IF(TYPE(Oktober!$I25)=2,\"\",\"-\"),Oktober!$M25)),0)","v":""},0,{"$f":"November!$A25","v":"Mo"},{"$f":"IF(AF18<>0,IF(OR(AF18=\"So\",AF18=\"Sa\"),\"WE\",IF(November!$M25=\"\",IF(TYPE(November!$I25)=2,\"\",\"-\"),November!$M25)),0)","v":""},0,{"$f":"Dezember!$A25","v":"Mi"},{"$f":"IF(AI18<>0,IF(OR(AI18=\"So\",AI18=\"Sa\"),\"WE\",IF(Dezember!$M25=\"\",IF(TYPE(Dezember!$I25)=2,\"\",\"-\"),Dezember!$M25)),0)","v":""},0]
[17,{"$f":"Januar!A26","v":"Sa"},{"$f":"IF(B19<>0,IF(OR(B19=\"So\",B19=\"Sa\"),\"WE\",IF(Januar!$M26=\"\",IF(TYPE(Januar!$I26)=2,\"\",\"-\"),Januar!$M26)),0)","v":"WE"},0,{"$f":"Februar!A26","v":"Di"},{"$f":"IF(E19<>0,IF(OR(E19=\"So\",E19=\"Sa\"),\"WE\",IF(Februar!$M26=\"\",IF(TYPE(Februar!$I26)=2,\"\",\"-\"),Februar!$M26)),0)","v":""},0,{"$f":"März!$A26","v":"Di"},{"$f":"IF(H19<>0,IF(OR(H19=\"So\",H19=\"Sa\"),\"WE\",IF(März!$M26=\"\",IF(TYPE(März!$I26)=2,\"\",\"-\"),März!$M26)),0)","v":""},0,{"$f":"April!$A26","v":"Fr"},{"$f":"IF(K19<>0,IF(OR(K19=\"So\",K19=\"Sa\"),\"WE\",IF(April!$M26=\"\",IF(TYPE(April!$I26)=2,\"\",\"-\"),April!$M26)),0)","v":""},0,{"$f":"Mai!$A26","v":"So"},{"$f":"IF(N19<>0,IF(OR(N19=\"So\",N19=\"Sa\"),\"WE\",IF(Mai!$M26=\"\",IF(TYPE(Mai!$I26)=2,\"\",\"-\"),Mai!$M26)),0)","v":"WE"},0,{"$f":"Juni!$A26","v":"Mi"},{"$f":"IF(Q19<>0,IF(OR(Q19=\"So\",Q19=\"Sa\"),\"WE\",IF(Juni!$M26=\"\",IF(TYPE(Juni!$I26)=2,\"\",\"-\"),Juni!$M26)),0)","v":""},0,{"$f":"Juli!$A26","v":"Fr"},{"$f":"IF(T19<>0,IF(OR(T19=\"So\",T19=\"Sa\"),\"WE\",IF(Juli!$M26=\"\",IF(TYPE(Juli!$I26)=2,\"\",\"-\"),Juli!$M26)),0)","v":""},0,{"$f":"August!$A26","v":"Mo"},{"$f":"IF(W19<>0,IF(OR(W19=\"So\",W19=\"Sa\"),\"WE\",IF(August!$M26=\"\",IF(TYPE(August!$I26)=2,\"\",\"-\"),August!$M26)),0)","v":""},0,{"$f":"September!$A26","v":"Do"},{"$f":"IF(Z19<>0,IF(OR(Z19=\"So\",Z19=\"Sa\"),\"WE\",IF(September!$M26=\"\",IF(TYPE(September!$I26)=2,\"\",\"-\"),September!$M26)),0)","v":""},0,{"$f":"Oktober!$A26","v":"Sa"},{"$f":"IF(AC19<>0,IF(OR(AC19=\"So\",AC19=\"Sa\"),\"WE\",IF(Oktober!$M26=\"\",IF(TYPE(Oktober!$I26)=2,\"\",\"-\"),Oktober!$M26)),0)","v":"WE"},0,{"$f":"November!$A26","v":"Di"},{"$f":"IF(AF19<>0,IF(OR(AF19=\"So\",AF19=\"Sa\"),\"WE\",IF(November!$M26=\"\",IF(TYPE(November!$I26)=2,\"\",\"-\"),November!$M26)),0)","v":""},0,{"$f":"Dezember!$A26","v":"Do"},{"$f":"IF(AI19<>0,IF(OR(AI19=\"So\",AI19=\"Sa\"),\"WE\",IF(Dezember!$M26=\"\",IF(TYPE(Dezember!$I26)=2,\"\",\"-\"),Dezember!$M26)),0)","v":""},0]
[18,{"$f":"Januar!A27","v":"So"},{"$f":"IF(B20<>0,IF(OR(B20=\"So\",B20=\"Sa\"),\"WE\",IF(Januar!$M27=\"\",IF(TYPE(Januar!$I27)=2,\"\",\"-\"),Januar!$M27)),0)","v":"WE"},0,{"$f":"Februar!A27","v":"Mi"},{"$f":"IF(E20<>0,IF(OR(E20=\"So\",E20=\"Sa\"),\"WE\",IF(Februar!$M27=\"\",IF(TYPE(Februar!$I27)=2,\"\",\"-\"),Februar!$M27)),0)","v":""},0,{"$f":"März!$A27","v":"Mi"},{"$f":"IF(H20<>0,IF(OR(H20=\"So\",H20=\"Sa\"),\"WE\",IF(März!$M27=\"\",IF(TYPE(März!$I27)=2,\"\",\"-\"),März!$M27)),0)","v":""},0,{"$f":"April!$A27","v":"Sa"},{"$f":"IF(K20<>0,IF(OR(K20=\"So\",K20=\"Sa\"),\"WE\",IF(April!$M27=\"\",IF(TYPE(April!$I27)=2,\"\",\"-\"),April!$M27)),0)","v":"WE"},0,{"$f":"Mai!$A27","v":"Mo"},{"$f":"IF(N20<>0,IF(OR(N20=\"So\",N20=\"Sa\"),\"WE\",IF(Mai!$M27=\"\",IF(TYPE(Mai!$I27)=2,\"\",\"-\"),Mai!$M27)),0)","v":""},0,{"$f":"Juni!$A27","v":"Do"},{"$f":"IF(Q20<>0,IF(OR(Q20=\"So\",Q20=\"Sa\"),\"WE\",IF(Juni!$M27=\"\",IF(TYPE(Juni!$I27)=2,\"\",\"-\"),Juni!$M27)),0)","v":""},0,{"$f":"Juli!$A27","v":"Sa"},{"$f":"IF(T20<>0,IF(OR(T20=\"So\",T20=\"Sa\"),\"WE\",IF(Juli!$M27=\"\",IF(TYPE(Juli!$I27)=2,\"\",\"-\"),Juli!$M27)),0)","v":"WE"},0,{"$f":"August!$A27","v":"Di"},{"$f":"IF(W20<>0,IF(OR(W20=\"So\",W20=\"Sa\"),\"WE\",IF(August!$M27=\"\",IF(TYPE(August!$I27)=2,\"\",\"-\"),August!$M27)),0)","v":""},0,{"$f":"September!$A27","v":"Fr"},{"$f":"IF(Z20<>0,IF(OR(Z20=\"So\",Z20=\"Sa\"),\"WE\",IF(September!$M27=\"\",IF(TYPE(September!$I27)=2,\"\",\"-\"),September!$M27)),0)","v":""},0,{"$f":"Oktober!$A27","v":"So"},{"$f":"IF(AC20<>0,IF(OR(AC20=\"So\",AC20=\"Sa\"),\"WE\",IF(Oktober!$M27=\"\",IF(TYPE(Oktober!$I27)=2,\"\",\"-\"),Oktober!$M27)),0)","v":"WE"},0,{"$f":"November!$A27","v":"Mi"},{"$f":"IF(AF20<>0,IF(OR(AF20=\"So\",AF20=\"Sa\"),\"WE\",IF(November!$M27=\"\",IF(TYPE(November!$I27)=2,\"\",\"-\"),November!$M27)),0)","v":""},0,{"$f":"Dezember!$A27","v":"Fr"},{"$f":"IF(AI20<>0,IF(OR(AI20=\"So\",AI20=\"Sa\"),\"WE\",IF(Dezember!$M27=\"\",IF(TYPE(Dezember!$I27)=2,\"\",\"-\"),Dezember!$M27)),0)","v":""},0]
[19,{"$f":"Januar!A28","v":"Mo"},{"$f":"IF(B21<>0,IF(OR(B21=\"So\",B21=\"Sa\"),\"WE\",IF(Januar!$M28=\"\",IF(TYPE(Januar!$I28)=2,\"\",\"-\"),Januar!$M28)),0)","v":""},0,{"$f":"Februar!A28","v":"Do"},{"$f":"IF(E21<>0,IF(OR(E21=\"So\",E21=\"Sa\"),\"WE\",IF(Februar!$M28=\"\",IF(TYPE(Februar!$I28)=2,\"\",\"-\"),Februar!$M28)),0)","v":""},0,{"$f":"März!$A28","v":"Do"},{"$f":"IF(H21<>0,IF(OR(H21=\"So\",H21=\"Sa\"),\"WE\",IF(März!$M28=\"\",IF(TYPE(März!$I28)=2,\"\",\"-\"),März!$M28)),0)","v":""},0,{"$f":"April!$A28","v":"So"},{"$f":"IF(K21<>0,IF(OR(K21=\"So\",K21=\"Sa\"),\"WE\",IF(April!$M28=\"\",IF(TYPE(April!$I28)=2,\"\",\"-\"),April!$M28)),0)","v":"WE"},0,{"$f":"Mai!$A28","v":"Di"},{"$f":"IF(N21<>0,IF(OR(N21=\"So\",N21=\"Sa\"),\"WE\",IF(Mai!$M28=\"\",IF(TYPE(Mai!$I28)=2,\"\",\"-\"),Mai!$M28)),0)","v":""},0,{"$f":"Juni!$A28","v":"Fr"},{"$f":"IF(Q21<>0,IF(OR(Q21=\"So\",Q21=\"Sa\"),\"WE\",IF(Juni!$M28=\"\",IF(TYPE(Juni!$I28)=2,\"\",\"-\"),Juni!$M28)),0)","v":""},0,{"$f":"Juli!$A28","v":"So"},{"$f":"IF(T21<>0,IF(OR(T21=\"So\",T21=\"Sa\"),\"WE\",IF(Juli!$M28=\"\",IF(TYPE(Juli!$I28)=2,\"\",\"-\"),Juli!$M28)),0)","v":"WE"},0,{"$f":"August!$A28","v":"Mi"},{"$f":"IF(W21<>0,IF(OR(W21=\"So\",W21=\"Sa\"),\"WE\",IF(August!$M28=\"\",IF(TYPE(August!$I28)=2,\"\",\"-\"),August!$M28)),0)","v":""},0,{"$f":"September!$A28","v":"Sa"},{"$f":"IF(Z21<>0,IF(OR(Z21=\"So\",Z21=\"Sa\"),\"WE\",IF(September!$M28=\"\",IF(TYPE(September!$I28)=2,\"\",\"-\"),September!$M28)),0)","v":"WE"},0,{"$f":"Oktober!$A28","v":"Mo"},{"$f":"IF(AC21<>0,IF(OR(AC21=\"So\",AC21=\"Sa\"),\"WE\",IF(Oktober!$M28=\"\",IF(TYPE(Oktober!$I28)=2,\"\",\"-\"),Oktober!$M28)),0)","v":""},0,{"$f":"November!$A28","v":"Do"},{"$f":"IF(AF21<>0,IF(OR(AF21=\"So\",AF21=\"Sa\"),\"WE\",IF(November!$M28=\"\",IF(TYPE(November!$I28)=2,\"\",\"-\"),November!$M28)),0)","v":""},0,{"$f":"Dezember!$A28","v":"Sa"},{"$f":"IF(AI21<>0,IF(OR(AI21=\"So\",AI21=\"Sa\"),\"WE\",IF(Dezember!$M28=\"\",IF(TYPE(Dezember!$I28)=2,\"\",\"-\"),Dezember!$M28)),0)","v":"WE"},0]
[20,{"$f":"Januar!A29","v":"Di"},{"$f":"IF(B22<>0,IF(OR(B22=\"So\",B22=\"Sa\"),\"WE\",IF(Januar!$M29=\"\",IF(TYPE(Januar!$I29)=2,\"\",\"-\"),Januar!$M29)),0)","v":""},0,{"$f":"Februar!A29","v":"Fr"},{"$f":"IF(E22<>0,IF(OR(E22=\"So\",E22=\"Sa\"),\"WE\",IF(Februar!$M29=\"\",IF(TYPE(Februar!$I29)=2,\"\",\"-\"),Februar!$M29)),0)","v":""},0,{"$f":"März!$A29","v":"Fr"},{"$f":"IF(H22<>0,IF(OR(H22=\"So\",H22=\"Sa\"),\"WE\",IF(März!$M29=\"\",IF(TYPE(März!$I29)=2,\"\",\"-\"),März!$M29)),0)","v":""},0,{"$f":"April!$A29","v":"Mo"},{"$f":"IF(K22<>0,IF(OR(K22=\"So\",K22=\"Sa\"),\"WE\",IF(April!$M29=\"\",IF(TYPE(April!$I29)=2,\"\",\"-\"),April!$M29)),0)","v":""},0,{"$f":"Mai!$A29","v":"Mi"},{"$f":"IF(N22<>0,IF(OR(N22=\"So\",N22=\"Sa\"),\"WE\",IF(Mai!$M29=\"\",IF(TYPE(Mai!$I29)=2,\"\",\"-\"),Mai!$M29)),0)","v":""},0,{"$f":"Juni!$A29","v":"Sa"},{"$f":"IF(Q22<>0,IF(OR(Q22=\"So\",Q22=\"Sa\"),\"WE\",IF(Juni!$M29=\"\",IF(TYPE(Juni!$I29)=2,\"\",\"-\"),Juni!$M29)),0)","v":"WE"},0,{"$f":"Juli!$A29","v":"Mo"},{"$f":"IF(T22<>0,IF(OR(T22=\"So\",T22=\"Sa\"),\"WE\",IF(Juli!$M29=\"\",IF(TYPE(Juli!$I29)=2,\"\",\"-\"),Juli!$M29)),0)","v":""},0,{"$f":"August!$A29","v":"Do"},{"$f":"IF(W22<>0,IF(OR(W22=\"So\",W22=\"Sa\"),\"WE\",IF(August!$M29=\"\",IF(TYPE(August!$I29)=2,\"\",\"-\"),August!$M29)),0)","v":""},0,{"$f":"September!$A29","v":"So"},{"$f":"IF(Z22<>0,IF(OR(Z22=\"So\",Z22=\"Sa\"),\"WE\",IF(September!$M29=\"\",IF(TYPE(September!$I29)=2,\"\",\"-\"),September!$M29)),0)","v":"WE"},0,{"$f":"Oktober!$A29","v":"Di"},{"$f":"IF(AC22<>0,IF(OR(AC22=\"So\",AC22=\"Sa\"),\"WE\",IF(Oktober!$M29=\"\",IF(TYPE(Oktober!$I29)=2,\"\",\"-\"),Oktober!$M29)),0)","v":""},0,{"$f":"November!$A29","v":"Fr"},{"$f":"IF(AF22<>0,IF(OR(AF22=\"So\",AF22=\"Sa\"),\"WE\",IF(November!$M29=\"\",IF(TYPE(November!$I29)=2,\"\",\"-\"),November!$M29)),0)","v":""},0,{"$f":"Dezember!$A29","v":"So"},{"$f":"IF(AI22<>0,IF(OR(AI22=\"So\",AI22=\"Sa\"),\"WE\",IF(Dezember!$M29=\"\",IF(TYPE(Dezember!$I29)=2,\"\",\"-\"),Dezember!$M29)),0)","v":"WE"},0]
[21,{"$f":"Januar!A30","v":"Mi"},{"$f":"IF(B23<>0,IF(OR(B23=\"So\",B23=\"Sa\"),\"WE\",IF(Januar!$M30=\"\",IF(TYPE(Januar!$I30)=2,\"\",\"-\"),Januar!$M30)),0)","v":""},0,{"$f":"Februar!A30","v":"Sa"},{"$f":"IF(E23<>0,IF(OR(E23=\"So\",E23=\"Sa\"),\"WE\",IF(Februar!$M30=\"\",IF(TYPE(Februar!$I30)=2,\"\",\"-\"),Februar!$M30)),0)","v":"WE"},0,{"$f":"März!$A30","v":"Sa"},{"$f":"IF(H23<>0,IF(OR(H23=\"So\",H23=\"Sa\"),\"WE\",IF(März!$M30=\"\",IF(TYPE(März!$I30)=2,\"\",\"-\"),März!$M30)),0)","v":"WE"},0,{"$f":"April!$A30","v":"Di"},{"$f":"IF(K23<>0,IF(OR(K23=\"So\",K23=\"Sa\"),\"WE\",IF(April!$M30=\"\",IF(TYPE(April!$I30)=2,\"\",\"-\"),April!$M30)),0)","v":""},0,{"$f":"Mai!$A30","v":"Do"},{"$f":"IF(N23<>0,IF(OR(N23=\"So\",N23=\"Sa\"),\"WE\",IF(Mai!$M30=\"\",IF(TYPE(Mai!$I30)=2,\"\",\"-\"),Mai!$M30)),0)","v":""},0,{"$f":"Juni!$A30","v":"So"},{"$f":"IF(Q23<>0,IF(OR(Q23=\"So\",Q23=\"Sa\"),\"WE\",IF(Juni!$M30=\"\",IF(TYPE(Juni!$I30)=2,\"\",\"-\"),Juni!$M30)),0)","v":"WE"},0,{"$f":"Juli!$A30","v":"Di"},{"$f":"IF(T23<>0,IF(OR(T23=\"So\",T23=\"Sa\"),\"WE\",IF(Juli!$M30=\"\",IF(TYPE(Juli!$I30)=2,\"\",\"-\"),Juli!$M30)),0)","v":""},0,{"$f":"August!$A30","v":"Fr"},{"$f":"IF(W23<>0,IF(OR(W23=\"So\",W23=\"Sa\"),\"WE\",IF(August!$M30=\"\",IF(TYPE(August!$I30)=2,\"\",\"-\"),August!$M30)),0)","v":""},0,{"$f":"September!$A30","v":"Mo"},{"$f":"IF(Z23<>0,IF(OR(Z23=\"So\",Z23=\"Sa\"),\"WE\",IF(September!$M30=\"\",IF(TYPE(September!$I30)=2,\"\",\"-\"),September!$M30)),0)","v":""},0,{"$f":"Oktober!$A30","v":"Mi"},{"$f":"IF(AC23<>0,IF(OR(AC23=\"So\",AC23=\"Sa\"),\"WE\",IF(Oktober!$M30=\"\",IF(TYPE(Oktober!$I30)=2,\"\",\"-\"),Oktober!$M30)),0)","v":""},0,{"$f":"November!$A30","v":"Sa"},{"$f":"IF(AF23<>0,IF(OR(AF23=\"So\",AF23=\"Sa\"),\"WE\",IF(November!$M30=\"\",IF(TYPE(November!$I30)=2,\"\",\"-\"),November!$M30)),0)","v":"WE"},0,{"$f":"Dezember!$A30","v":"Mo"},{"$f":"IF(AI23<>0,IF(OR(AI23=\"So\",AI23=\"Sa\"),\"WE\",IF(Dezember!$M30=\"\",IF(TYPE(Dezember!$I30)=2,\"\",\"-\"),Dezember!$M30)),0)","v":""},0]
[22,{"$f":"Januar!A31","v":"Do"},{"$f":"IF(B24<>0,IF(OR(B24=\"So\",B24=\"Sa\"),\"WE\",IF(Januar!$M31=\"\",IF(TYPE(Januar!$I31)=2,\"\",\"-\"),Januar!$M31)),0)","v":""},0,{"$f":"Februar!A31","v":"So"},{"$f":"IF(E24<>0,IF(OR(E24=\"So\",E24=\"Sa\"),\"WE\",IF(Februar!$M31=\"\",IF(TYPE(Februar!$I31)=2,\"\",\"-\"),Februar!$M31)),0)","v":"WE"},0,{"$f":"März!$A31","v":"So"},{"$f":"IF(H24<>0,IF(OR(H24=\"So\",H24=\"Sa\"),\"WE\",IF(März!$M31=\"\",IF(TYPE(März!$I31)=2,\"\",\"-\"),März!$M31)),0)","v":"WE"},0,{"$f":"April!$A31","v":"Mi"},{"$f":"IF(K24<>0,IF(OR(K24=\"So\",K24=\"Sa\"),\"WE\",IF(April!$M31=\"\",IF(TYPE(April!$I31)=2,\"\",\"-\"),April!$M31)),0)","v":""},0,{"$f":"Mai!$A31","v":"Fr"},{"$f":"IF(N24<>0,IF(OR(N24=\"So\",N24=\"Sa\"),\"WE\",IF(Mai!$M31=\"\",IF(TYPE(Mai!$I31)=2,\"\",\"-\"),Mai!$M31)),0)","v":""},0,{"$f":"Juni!$A31","v":"Mo"},{"$f":"IF(Q24<>0,IF(OR(Q24=\"So\",Q24=\"Sa\"),\"WE\",IF(Juni!$M31=\"\",IF(TYPE(Juni!$I31)=2,\"\",\"-\"),Juni!$M31)),0)","v":""},0,{"$f":"Juli!$A31","v":"Mi"},{"$f":"IF(T24<>0,IF(OR(T24=\"So\",T24=\"Sa\"),\"WE\",IF(Juli!$M31=\"\",IF(TYPE(Juli!$I31)=2,\"\",\"-\"),Juli!$M31)),0)","v":""},0,{"$f":"August!$A31","v":"Sa"},{"$f":"IF(W24<>0,IF(OR(W24=\"So\",W24=\"Sa\"),\"WE\",IF(August!$M31=\"\",IF(TYPE(August!$I31)=2,\"\",\"-\"),August!$M31)),0)","v":"WE"},0,{"$f":"September!$A31","v":"Di"},{"$f":"IF(Z24<>0,IF(OR(Z24=\"So\",Z24=\"Sa\"),\"WE\",IF(September!$M31=\"\",IF(TYPE(September!$I31)=2,\"\",\"-\"),September!$M31)),0)","v":""},0,{"$f":"Oktober!$A31","v":"Do"},{"$f":"IF(AC24<>0,IF(OR(AC24=\"So\",AC24=\"Sa\"),\"WE\",IF(Oktober!$M31=\"\",IF(TYPE(Oktober!$I31)=2,\"\",\"-\"),Oktober!$M31)),0)","v":""},0,{"$f":"November!$A31","v":"So"},{"$f":"IF(AF24<>0,IF(OR(AF24=\"So\",AF24=\"Sa\"),\"WE\",IF(November!$M31=\"\",IF(TYPE(November!$I31)=2,\"\",\"-\"),November!$M31)),0)","v":"WE"},0,{"$f":"Dezember!$A31","v":"Di"},{"$f":"IF(AI24<>0,IF(OR(AI24=\"So\",AI24=\"Sa\"),\"WE\",IF(Dezember!$M31=\"\",IF(TYPE(Dezember!$I31)=2,\"\",\"-\"),Dezember!$M31)),0)","v":""},0]
[23,{"$f":"Januar!A32","v":"Fr"},{"$f":"IF(B25<>0,IF(OR(B25=\"So\",B25=\"Sa\"),\"WE\",IF(Januar!$M32=\"\",IF(TYPE(Januar!$I32)=2,\"\",\"-\"),Januar!$M32)),0)","v":""},0,{"$f":"Februar!A32","v":"Mo"},{"$f":"IF(E25<>0,IF(OR(E25=\"So\",E25=\"Sa\"),\"WE\",IF(Februar!$M32=\"\",IF(TYPE(Februar!$I32)=2,\"\",\"-\"),Februar!$M32)),0)","v":""},0,{"$f":"März!$A32","v":"Mo"},{"$f":"IF(H25<>0,IF(OR(H25=\"So\",H25=\"Sa\"),\"WE\",IF(März!$M32=\"\",IF(TYPE(März!$I32)=2,\"\",\"-\"),März!$M32)),0)","v":""},0,{"$f":"April!$A32","v":"Do"},{"$f":"IF(K25<>0,IF(OR(K25=\"So\",K25=\"Sa\"),\"WE\",IF(April!$M32=\"\",IF(TYPE(April!$I32)=2,\"\",\"-\"),April!$M32)),0)","v":""},0,{"$f":"Mai!$A32","v":"Sa"},{"$f":"IF(N25<>0,IF(OR(N25=\"So\",N25=\"Sa\"),\"WE\",IF(Mai!$M32=\"\",IF(TYPE(Mai!$I32)=2,\"\",\"-\"),Mai!$M32)),0)","v":"WE"},0,{"$f":"Juni!$A32","v":"Di"},{"$f":"IF(Q25<>0,IF(OR(Q25=\"So\",Q25=\"Sa\"),\"WE\",IF(Juni!$M32=\"\",IF(TYPE(Juni!$I32)=2,\"\",\"-\"),Juni!$M32)),0)","v":""},0,{"$f":"Juli!$A32","v":"Do"},{"$f":"IF(T25<>0,IF(OR(T25=\"So\",T25=\"Sa\"),\"WE\",IF(Juli!$M32=\"\",IF(TYPE(Juli!$I32)=2,\"\",\"-\"),Juli!$M32)),0)","v":""},0,{"$f":"August!$A32","v":"So"},{"$f":"IF(W25<>0,IF(OR(W25=\"So\",W25=\"Sa\"),\"WE\",IF(August!$M32=\"\",IF(TYPE(August!$I32)=2,\"\",\"-\"),August!$M32)),0)","v":"WE"},0,{"$f":"September!$A32","v":"Mi"},{"$f":"IF(Z25<>0,IF(OR(Z25=\"So\",Z25=\"Sa\"),\"WE\",IF(September!$M32=\"\",IF(TYPE(September!$I32)=2,\"\",\"-\"),September!$M32)),0)","v":""},0,{"$f":"Oktober!$A32","v":"Fr"},{"$f":"IF(AC25<>0,IF(OR(AC25=\"So\",AC25=\"Sa\"),\"WE\",IF(Oktober!$M32=\"\",IF(TYPE(Oktober!$I32)=2,\"\",\"-\"),Oktober!$M32)),0)","v":""},0,{"$f":"November!$A32","v":"Mo"},{"$f":"IF(AF25<>0,IF(OR(AF25=\"So\",AF25=\"Sa\"),\"WE\",IF(November!$M32=\"\",IF(TYPE(November!$I32)=2,\"\",\"-\"),November!$M32)),0)","v":""},0,{"$f":"Dezember!$A32","v":"Mi"},{"$f":"IF(AI25<>0,IF(OR(AI25=\"So\",AI25=\"Sa\"),\"WE\",IF(Dezember!$M32=\"\",IF(TYPE(Dezember!$I32)=2,\"\",\"-\"),Dezember!$M32)),0)","v":""},0]
[24,{"$f":"Januar!A33","v":"Sa"},{"$f":"IF(B26<>0,IF(OR(B26=\"So\",B26=\"Sa\"),\"WE\",IF(Januar!$M33=\"\",IF(TYPE(Januar!$I33)=2,\"\",\"-\"),Januar!$M33)),0)","v":"WE"},0,{"$f":"Februar!A33","v":"Di"},{"$f":"IF(E26<>0,IF(OR(E26=\"So\",E26=\"Sa\"),\"WE\",IF(Februar!$M33=\"\",IF(TYPE(Februar!$I33)=2,\"\",\"-\"),Februar!$M33)),0)","v":""},0,{"$f":"März!$A33","v":"Di"},{"$f":"IF(H26<>0,IF(OR(H26=\"So\",H26=\"Sa\"),\"WE\",IF(März!$M33=\"\",IF(TYPE(März!$I33)=2,\"\",\"-\"),März!$M33)),0)","v":""},0,{"$f":"April!$A33","v":"Fr"},{"$f":"IF(K26<>0,IF(OR(K26=\"So\",K26=\"Sa\"),\"WE\",IF(April!$M33=\"\",IF(TYPE(April!$I33)=2,\"\",\"-\"),April!$M33)),0)","v":""},0,{"$f":"Mai!$A33","v":"So"},{"$f":"IF(N26<>0,IF(OR(N26=\"So\",N26=\"Sa\"),\"WE\",IF(Mai!$M33=\"\",IF(TYPE(Mai!$I33)=2,\"\",\"-\"),Mai!$M33)),0)","v":"WE"},0,{"$f":"Juni!$A33","v":"Mi"},{"$f":"IF(Q26<>0,IF(OR(Q26=\"So\",Q26=\"Sa\"),\"WE\",IF(Juni!$M33=\"\",IF(TYPE(Juni!$I33)=2,\"\",\"-\"),Juni!$M33)),0)","v":""},0,{"$f":"Juli!$A33","v":"Fr"},{"$f":"IF(T26<>0,IF(OR(T26=\"So\",T26=\"Sa\"),\"WE\",IF(Juli!$M33=\"\",IF(TYPE(Juli!$I33)=2,\"\",\"-\"),Juli!$M33)),0)","v":""},0,{"$f":"August!$A33","v":"Mo"},{"$f":"IF(W26<>0,IF(OR(W26=\"So\",W26=\"Sa\"),\"WE\",IF(August!$M33=\"\",IF(TYPE(August!$I33)=2,\"\",\"-\"),August!$M33)),0)","v":""},0,{"$f":"September!$A33","v":"Do"},{"$f":"IF(Z26<>0,IF(OR(Z26=\"So\",Z26=\"Sa\"),\"WE\",IF(September!$M33=\"\",IF(TYPE(September!$I33)=2,\"\",\"-\"),September!$M33)),0)","v":""},0,{"$f":"Oktober!$A33","v":"Sa"},{"$f":"IF(AC26<>0,IF(OR(AC26=\"So\",AC26=\"Sa\"),\"WE\",IF(Oktober!$M33=\"\",IF(TYPE(Oktober!$I33)=2,\"\",\"-\"),Oktober!$M33)),0)","v":"WE"},0,{"$f":"November!$A33","v":"Di"},{"$f":"IF(AF26<>0,IF(OR(AF26=\"So\",AF26=\"Sa\"),\"WE\",IF(November!$M33=\"\",IF(TYPE(November!$I33)=2,\"\",\"-\"),November!$M33)),0)","v":""},0,{"$f":"Dezember!$A33","v":"Do"},{"$f":"IF(AI26<>0,IF(OR(AI26=\"So\",AI26=\"Sa\"),\"WE\",IF(Dezember!$M33=\"\",IF(TYPE(Dezember!$I33)=2,\"\",\"-\"),Dezember!$M33)),0)","v":"FT"},0]
[25,{"$f":"Januar!A34","v":"So"},{"$f":"IF(B27<>0,IF(OR(B27=\"So\",B27=\"Sa\"),\"WE\",IF(Januar!$M34=\"\",IF(TYPE(Januar!$I34)=2,\"\",\"-\"),Januar!$M34)),0)","v":"WE"},0,{"$f":"Februar!A34","v":"Mi"},{"$f":"IF(E27<>0,IF(OR(E27=\"So\",E27=\"Sa\"),\"WE\",IF(Februar!$M34=\"\",IF(TYPE(Februar!$I34)=2,\"\",\"-\"),Februar!$M34)),0)","v":""},0,{"$f":"März!$A34","v":"Mi"},{"$f":"IF(H27<>0,IF(OR(H27=\"So\",H27=\"Sa\"),\"WE\",IF(März!$M34=\"\",IF(TYPE(März!$I34)=2,\"\",\"-\"),März!$M34)),0)","v":""},0,{"$f":"April!$A34","v":"Sa"},{"$f":"IF(K27<>0,IF(OR(K27=\"So\",K27=\"Sa\"),\"WE\",IF(April!$M34=\"\",IF(TYPE(April!$I34)=2,\"\",\"-\"),April!$M34)),0)","v":"WE"},0,{"$f":"Mai!$A34","v":"Mo"},{"$f":"IF(N27<>0,IF(OR(N27=\"So\",N27=\"Sa\"),\"WE\",IF(Mai!$M34=\"\",IF(TYPE(Mai!$I34)=2,\"\",\"-\"),Mai!$M34)),0)","v":"FT"},0,{"$f":"Juni!$A34","v":"Do"},{"$f":"IF(Q27<>0,IF(OR(Q27=\"So\",Q27=\"Sa\"),\"WE\",IF(Juni!$M34=\"\",IF(TYPE(Juni!$I34)=2,\"\",\"-\"),Juni!$M34)),0)","v":""},0,{"$f":"Juli!$A34","v":"Sa"},{"$f":"IF(T27<>0,IF(OR(T27=\"So\",T27=\"Sa\"),\"WE\",IF(Juli!$M34=\"\",IF(TYPE(Juli!$I34)=2,\"\",\"-\"),Juli!$M34)),0)","v":"WE"},0,{"$f":"August!$A34","v":"Di"},{"$f":"IF(W27<>0,IF(OR(W27=\"So\",W27=\"Sa\"),\"WE\",IF(August!$M34=\"\",IF(TYPE(August!$I34)=2,\"\",\"-\"),August!$M34)),0)","v":""},0,{"$f":"September!$A34","v":"Fr"},{"$f":"IF(Z27<>0,IF(OR(Z27=\"So\",Z27=\"Sa\"),\"WE\",IF(September!$M34=\"\",IF(TYPE(September!$I34)=2,\"\",\"-\"),September!$M34)),0)","v":""},0,{"$f":"Oktober!$A34","v":"So"},{"$f":"IF(AC27<>0,IF(OR(AC27=\"So\",AC27=\"Sa\"),\"WE\",IF(Oktober!$M34=\"\",IF(TYPE(Oktober!$I34)=2,\"\",\"-\"),Oktober!$M34)),0)","v":"WE"},0,{"$f":"November!$A34","v":"Mi"},{"$f":"IF(AF27<>0,IF(OR(AF27=\"So\",AF27=\"Sa\"),\"WE\",IF(November!$M34=\"\",IF(TYPE(November!$I34)=2,\"\",\"-\"),November!$M34)),0)","v":""},0,{"$f":"Dezember!$A34","v":"Fr"},{"$f":"IF(AI27<>0,IF(OR(AI27=\"So\",AI27=\"Sa\"),\"WE\",IF(Dezember!$M34=\"\",IF(TYPE(Dezember!$I34)=2,\"\",\"-\"),Dezember!$M34)),0)","v":"FT"},0]
[26,{"$f":"Januar!A35","v":"Mo"},{"$f":"IF(B28<>0,IF(OR(B28=\"So\",B28=\"Sa\"),\"WE\",IF(Januar!$M35=\"\",IF(TYPE(Januar!$I35)=2,\"\",\"-\"),Januar!$M35)),0)","v":""},0,{"$f":"Februar!A35","v":"Do"},{"$f":"IF(E28<>0,IF(OR(E28=\"So\",E28=\"Sa\"),\"WE\",IF(Februar!$M35=\"\",IF(TYPE(Februar!$I35)=2,\"\",\"-\"),Februar!$M35)),0)","v":""},0,{"$f":"März!$A35","v":"Do"},{"$f":"IF(H28<>0,IF(OR(H28=\"So\",H28=\"Sa\"),\"WE\",IF(März!$M35=\"\",IF(TYPE(März!$I35)=2,\"\",\"-\"),März!$M35)),0)","v":""},0,{"$f":"April!$A35","v":"So"},{"$f":"IF(K28<>0,IF(OR(K28=\"So\",K28=\"Sa\"),\"WE\",IF(April!$M35=\"\",IF(TYPE(April!$I35)=2,\"\",\"-\"),April!$M35)),0)","v":"WE"},0,{"$f":"Mai!$A35","v":"Di"},{"$f":"IF(N28<>0,IF(OR(N28=\"So\",N28=\"Sa\"),\"WE\",IF(Mai!$M35=\"\",IF(TYPE(Mai!$I35)=2,\"\",\"-\"),Mai!$M35)),0)","v":""},0,{"$f":"Juni!$A35","v":"Fr"},{"$f":"IF(Q28<>0,IF(OR(Q28=\"So\",Q28=\"Sa\"),\"WE\",IF(Juni!$M35=\"\",IF(TYPE(Juni!$I35)=2,\"\",\"-\"),Juni!$M35)),0)","v":""},0,{"$f":"Juli!$A35","v":"So"},{"$f":"IF(T28<>0,IF(OR(T28=\"So\",T28=\"Sa\"),\"WE\",IF(Juli!$M35=\"\",IF(TYPE(Juli!$I35)=2,\"\",\"-\"),Juli!$M35)),0)","v":"WE"},0,{"$f":"August!$A35","v":"Mi"},{"$f":"IF(W28<>0,IF(OR(W28=\"So\",W28=\"Sa\"),\"WE\",IF(August!$M35=\"\",IF(TYPE(August!$I35)=2,\"\",\"-\"),August!$M35)),0)","v":""},0,{"$f":"September!$A35","v":"Sa"},{"$f":"IF(Z28<>0,IF(OR(Z28=\"So\",Z28=\"Sa\"),\"WE\",IF(September!$M35=\"\",IF(TYPE(September!$I35)=2,\"\",\"-\"),September!$M35)),0)","v":"WE"},0,{"$f":"Oktober!$A35","v":"Mo"},{"$f":"IF(AC28<>0,IF(OR(AC28=\"So\",AC28=\"Sa\"),\"WE\",IF(Oktober!$M35=\"\",IF(TYPE(Oktober!$I35)=2,\"\",\"-\"),Oktober!$M35)),0)","v":""},0,{"$f":"November!$A35","v":"Do"},{"$f":"IF(AF28<>0,IF(OR(AF28=\"So\",AF28=\"Sa\"),\"WE\",IF(November!$M35=\"\",IF(TYPE(November!$I35)=2,\"\",\"-\"),November!$M35)),0)","v":""},0,{"$f":"Dezember!$A35","v":"Sa"},{"$f":"IF(AI28<>0,IF(OR(AI28=\"So\",AI28=\"Sa\"),\"WE\",IF(Dezember!$M35=\"\",IF(TYPE(Dezember!$I35)=2,\"\",\"-\"),Dezember!$M35)),0)","v":"WE"},0]
[27,{"$f":"Januar!A36","v":"Di"},{"$f":"IF(B29<>0,IF(OR(B29=\"So\",B29=\"Sa\"),\"WE\",IF(Januar!$M36=\"\",IF(TYPE(Januar!$I36)=2,\"\",\"-\"),Januar!$M36)),0)","v":""},0,{"$f":"Februar!A36","v":"Fr"},{"$f":"IF(E29<>0,IF(OR(E29=\"So\",E29=\"Sa\"),\"WE\",IF(Februar!$M36=\"\",IF(TYPE(Februar!$I36)=2,\"\",\"-\"),Februar!$M36)),0)","v":""},0,{"$f":"März!$A36","v":"Fr"},{"$f":"IF(H29<>0,IF(OR(H29=\"So\",H29=\"Sa\"),\"WE\",IF(März!$M36=\"\",IF(TYPE(März!$I36)=2,\"\",\"-\"),März!$M36)),0)","v":""},0,{"$f":"April!$A36","v":"Mo"},{"$f":"IF(K29<>0,IF(OR(K29=\"So\",K29=\"Sa\"),\"WE\",IF(April!$M36=\"\",IF(TYPE(April!$I36)=2,\"\",\"-\"),April!$M36)),0)","v":""},0,{"$f":"Mai!$A36","v":"Mi"},{"$f":"IF(N29<>0,IF(OR(N29=\"So\",N29=\"Sa\"),\"WE\",IF(Mai!$M36=\"\",IF(TYPE(Mai!$I36)=2,\"\",\"-\"),Mai!$M36)),0)","v":""},0,{"$f":"Juni!$A36","v":"Sa"},{"$f":"IF(Q29<>0,IF(OR(Q29=\"So\",Q29=\"Sa\"),\"WE\",IF(Juni!$M36=\"\",IF(TYPE(Juni!$I36)=2,\"\",\"-\"),Juni!$M36)),0)","v":"WE"},0,{"$f":"Juli!$A36","v":"Mo"},{"$f":"IF(T29<>0,IF(OR(T29=\"So\",T29=\"Sa\"),\"WE\",IF(Juli!$M36=\"\",IF(TYPE(Juli!$I36)=2,\"\",\"-\"),Juli!$M36)),0)","v":""},0,{"$f":"August!$A36","v":"Do"},{"$f":"IF(W29<>0,IF(OR(W29=\"So\",W29=\"Sa\"),\"WE\",IF(August!$M36=\"\",IF(TYPE(August!$I36)=2,\"\",\"-\"),August!$M36)),0)","v":""},0,{"$f":"September!$A36","v":"So"},{"$f":"IF(Z29<>0,IF(OR(Z29=\"So\",Z29=\"Sa\"),\"WE\",IF(September!$M36=\"\",IF(TYPE(September!$I36)=2,\"\",\"-\"),September!$M36)),0)","v":"WE"},0,{"$f":"Oktober!$A36","v":"Di"},{"$f":"IF(AC29<>0,IF(OR(AC29=\"So\",AC29=\"Sa\"),\"WE\",IF(Oktober!$M36=\"\",IF(TYPE(Oktober!$I36)=2,\"\",\"-\"),Oktober!$M36)),0)","v":""},0,{"$f":"November!$A36","v":"Fr"},{"$f":"IF(AF29<>0,IF(OR(AF29=\"So\",AF29=\"Sa\"),\"WE\",IF(November!$M36=\"\",IF(TYPE(November!$I36)=2,\"\",\"-\"),November!$M36)),0)","v":""},0,{"$f":"Dezember!$A36","v":"So"},{"$f":"IF(AI29<>0,IF(OR(AI29=\"So\",AI29=\"Sa\"),\"WE\",IF(Dezember!$M36=\"\",IF(TYPE(Dezember!$I36)=2,\"\",\"-\"),Dezember!$M36)),0)","v":"WE"},0]
[28,{"$f":"Januar!A37","v":"Mi"},{"$f":"IF(B30<>0,IF(OR(B30=\"So\",B30=\"Sa\"),\"WE\",IF(Januar!$M37=\"\",IF(TYPE(Januar!$I37)=2,\"\",\"-\"),Januar!$M37)),0)","v":""},0,{"$f":"Februar!A37","v":"Sa"},{"$f":"IF(E30<>0,IF(OR(E30=\"So\",E30=\"Sa\"),\"WE\",IF(Februar!$M37=\"\",IF(TYPE(Februar!$I37)=2,\"\",\"-\"),Februar!$M37)),0)","v":"WE"},0,{"$f":"März!$A37","v":"Sa"},{"$f":"IF(H30<>0,IF(OR(H30=\"So\",H30=\"Sa\"),\"WE\",IF(März!$M37=\"\",IF(TYPE(März!$I37)=2,\"\",\"-\"),März!$M37)),0)","v":"WE"},0,{"$f":"April!$A37","v":"Di"},{"$f":"IF(K30<>0,IF(OR(K30=\"So\",K30=\"Sa\"),\"WE\",IF(April!$M37=\"\",IF(TYPE(April!$I37)=2,\"\",\"-\"),April!$M37)),0)","v":""},0,{"$f":"Mai!$A37","v":"Do"},{"$f":"IF(N30<>0,IF(OR(N30=\"So\",N30=\"Sa\"),\"WE\",IF(Mai!$M37=\"\",IF(TYPE(Mai!$I37)=2,\"\",\"-\"),Mai!$M37)),0)","v":""},0,{"$f":"Juni!$A37","v":"So"},{"$f":"IF(Q30<>0,IF(OR(Q30=\"So\",Q30=\"Sa\"),\"WE\",IF(Juni!$M37=\"\",IF(TYPE(Juni!$I37)=2,\"\",\"-\"),Juni!$M37)),0)","v":"WE"},0,{"$f":"Juli!$A37","v":"Di"},{"$f":"IF(T30<>0,IF(OR(T30=\"So\",T30=\"Sa\"),\"WE\",IF(Juli!$M37=\"\",IF(TYPE(Juli!$I37)=2,\"\",\"-\"),Juli!$M37)),0)","v":""},0,{"$f":"August!$A37","v":"Fr"},{"$f":"IF(W30<>0,IF(OR(W30=\"So\",W30=\"Sa\"),\"WE\",IF(August!$M37=\"\",IF(TYPE(August!$I37)=2,\"\",\"-\"),August!$M37)),0)","v":""},0,{"$f":"September!$A37","v":"Mo"},{"$f":"IF(Z30<>0,IF(OR(Z30=\"So\",Z30=\"Sa\"),\"WE\",IF(September!$M37=\"\",IF(TYPE(September!$I37)=2,\"\",\"-\"),September!$M37)),0)","v":""},0,{"$f":"Oktober!$A37","v":"Mi"},{"$f":"IF(AC30<>0,IF(OR(AC30=\"So\",AC30=\"Sa\"),\"WE\",IF(Oktober!$M37=\"\",IF(TYPE(Oktober!$I37)=2,\"\",\"-\"),Oktober!$M37)),0)","v":""},0,{"$f":"November!$A37","v":"Sa"},{"$f":"IF(AF30<>0,IF(OR(AF30=\"So\",AF30=\"Sa\"),\"WE\",IF(November!$M37=\"\",IF(TYPE(November!$I37)=2,\"\",\"-\"),November!$M37)),0)","v":"WE"},0,{"$f":"Dezember!$A37","v":"Mo"},{"$f":"IF(AI30<>0,IF(OR(AI30=\"So\",AI30=\"Sa\"),\"WE\",IF(Dezember!$M37=\"\",IF(TYPE(Dezember!$I37)=2,\"\",\"-\"),Dezember!$M37)),0)","v":""},0]
[29,{"$f":"Januar!A38","v":"Do"},{"$f":"IF(B31<>0,IF(OR(B31=\"So\",B31=\"Sa\"),\"WE\",IF(Januar!$M38=\"\",IF(TYPE(Januar!$I38)=2,\"\",\"-\"),Januar!$M38)),0)","v":""},0,{"$f":"Februar!A38","v":"Sa"},{"$f":"IF(E31<>0,IF(OR(E31=\"So\",E31=\"Sa\"),\"WE\",IF(Februar!$M38=\"\",IF(TYPE(Februar!$I38)=2,\"\",\"-\"),Februar!$M38)),0)","v":"WE"},0,{"$f":"März!$A38","v":"So"},{"$f":"IF(H31<>0,IF(OR(H31=\"So\",H31=\"Sa\"),\"WE\",IF(März!$M38=\"\",IF(TYPE(März!$I38)=2,\"\",\"-\"),März!$M38)),0)","v":"WE"},0,{"$f":"April!$A38","v":"Mi"},{"$f":"IF(K31<>0,IF(OR(K31=\"So\",K31=\"Sa\"),\"WE\",IF(April!$M38=\"\",IF(TYPE(April!$I38)=2,\"\",\"-\"),April!$M38)),0)","v":""},0,{"$f":"Mai!$A38","v":"Fr"},{"$f":"IF(N31<>0,IF(OR(N31=\"So\",N31=\"Sa\"),\"WE\",IF(Mai!$M38=\"\",IF(TYPE(Mai!$I38)=2,\"\",\"-\"),Mai!$M38)),0)","v":""},0,{"$f":"Juni!$A38","v":"Mo"},{"$f":"IF(Q31<>0,IF(OR(Q31=\"So\",Q31=\"Sa\"),\"WE\",IF(Juni!$M38=\"\",IF(TYPE(Juni!$I38)=2,\"\",\"-\"),Juni!$M38)),0)","v":""},0,{"$f":"Juli!$A38","v":"Mi"},{"$f":"IF(T31<>0,IF(OR(T31=\"So\",T31=\"Sa\"),\"WE\",IF(Juli!$M38=\"\",IF(TYPE(Juli!$I38)=2,\"\",\"-\"),Juli!$M38)),0)","v":""},0,{"$f":"August!$A38","v":"Sa"},{"$f":"IF(W31<>0,IF(OR(W31=\"So\",W31=\"Sa\"),\"WE\",IF(August!$M38=\"\",IF(TYPE(August!$I38)=2,\"\",\"-\"),August!$M38)),0)","v":"WE"},0,{"$f":"September!$A38","v":"Di"},{"$f":"IF(Z31<>0,IF(OR(Z31=\"So\",Z31=\"Sa\"),\"WE\",IF(September!$M38=\"\",IF(TYPE(September!$I38)=2,\"\",\"-\"),September!$M38)),0)","v":""},0,{"$f":"Oktober!$A38","v":"Do"},{"$f":"IF(AC31<>0,IF(OR(AC31=\"So\",AC31=\"Sa\"),\"WE\",IF(Oktober!$M38=\"\",IF(TYPE(Oktober!$I38)=2,\"\",\"-\"),Oktober!$M38)),0)","v":""},0,{"$f":"November!$A38","v":"So"},{"$f":"IF(AF31<>0,IF(OR(AF31=\"So\",AF31=\"Sa\"),\"WE\",IF(November!$M38=\"\",IF(TYPE(November!$I38)=2,\"\",\"-\"),November!$M38)),0)","v":"WE"},0,{"$f":"Dezember!$A38","v":"Di"},{"$f":"IF(AI31<>0,IF(OR(AI31=\"So\",AI31=\"Sa\"),\"WE\",IF(Dezember!$M38=\"\",IF(TYPE(Dezember!$I38)=2,\"\",\"-\"),Dezember!$M38)),0)","v":""},0]
[30,{"$f":"Januar!A39","v":"Fr"},{"$f":"IF(B32<>0,IF(OR(B32=\"So\",B32=\"Sa\"),\"WE\",IF(Januar!$M39=\"\",IF(TYPE(Januar!$I39)=2,\"\",\"-\"),Januar!$M39)),0)","v":""},0,{"$f":"Februar!A39","v":0},{"$f":"IF(E32<>0,IF(OR(E32=\"So\",E32=\"Sa\"),\"WE\",IF(Februar!$M39=\"\",IF(TYPE(Februar!$I39)=2,\"\",\"-\"),Februar!$M39)),0)","v":0},0,{"$f":"März!$A39","v":"Mo"},{"$f":"IF(H32<>0,IF(OR(H32=\"So\",H32=\"Sa\"),\"WE\",IF(März!$M39=\"\",IF(TYPE(März!$I39)=2,\"\",\"-\"),März!$M39)),0)","v":""},0,{"$f":"April!$A39","v":"Do"},{"$f":"IF(K32<>0,IF(OR(K32=\"So\",K32=\"Sa\"),\"WE\",IF(April!$M39=\"\",IF(TYPE(April!$I39)=2,\"\",\"-\"),April!$M39)),0)","v":""},0,{"$f":"Mai!$A39","v":"Sa"},{"$f":"IF(N32<>0,IF(OR(N32=\"So\",N32=\"Sa\"),\"WE\",IF(Mai!$M39=\"\",IF(TYPE(Mai!$I39)=2,\"\",\"-\"),Mai!$M39)),0)","v":"WE"},0,{"$f":"Juni!$A39","v":"Di"},{"$f":"IF(Q32<>0,IF(OR(Q32=\"So\",Q32=\"Sa\"),\"WE\",IF(Juni!$M39=\"\",IF(TYPE(Juni!$I39)=2,\"\",\"-\"),Juni!$M39)),0)","v":""},0,{"$f":"Juli!$A39","v":"Do"},{"$f":"IF(T32<>0,IF(OR(T32=\"So\",T32=\"Sa\"),\"WE\",IF(Juli!$M39=\"\",IF(TYPE(Juli!$I39)=2,\"\",\"-\"),Juli!$M39)),0)","v":""},0,{"$f":"August!$A39","v":"So"},{"$f":"IF(W32<>0,IF(OR(W32=\"So\",W32=\"Sa\"),\"WE\",IF(August!$M39=\"\",IF(TYPE(August!$I39)=2,\"\",\"-\"),August!$M39)),0)","v":"WE"},0,{"$f":"September!$A39","v":"Mi"},{"$f":"IF(Z32<>0,IF(OR(Z32=\"So\",Z32=\"Sa\"),\"WE\",IF(September!$M39=\"\",IF(TYPE(September!$I39)=2,\"\",\"-\"),September!$M39)),0)","v":""},0,{"$f":"Oktober!$A39","v":"Fr"},{"$f":"IF(AC32<>0,IF(OR(AC32=\"So\",AC32=\"Sa\"),\"WE\",IF(Oktober!$M39=\"\",IF(TYPE(Oktober!$I39)=2,\"\",\"-\"),Oktober!$M39)),0)","v":""},0,{"$f":"November!$A39","v":"Mo"},{"$f":"IF(AF32<>0,IF(OR(AF32=\"So\",AF32=\"Sa\"),\"WE\",IF(November!$M39=\"\",IF(TYPE(November!$I39)=2,\"\",\"-\"),November!$M39)),0)","v":""},0,{"$f":"Dezember!$A39","v":"Mi"},{"$f":"IF(AI32<>0,IF(OR(AI32=\"So\",AI32=\"Sa\"),\"WE\",IF(Dezember!$M39=\"\",IF(TYPE(Dezember!$I39)=2,\"\",\"-\"),Dezember!$M39)),0)","v":""},0]
[31,{"$f":"Januar!A40","v":"Sa"},{"$f":"IF(B33<>0,IF(OR(B33=\"So\",B33=\"Sa\"),\"WE\",IF(Januar!$M40=\"\",IF(TYPE(Januar!$I40)=2,\"\",\"-\"),Januar!$M40)),0)","v":"WE"},0,{"$f":"Februar!A40","v":0},{"$f":"IF(E33<>0,IF(OR(E33=\"So\",E33=\"Sa\"),\"WE\",IF(Februar!$M40=\"\",IF(TYPE(Februar!$I40)=2,\"\",\"-\"),Februar!$M40)),0)","v":0},0,{"$f":"März!$A40","v":"Di"},{"$f":"IF(H33<>0,IF(OR(H33=\"So\",H33=\"Sa\"),\"WE\",IF(März!$M40=\"\",IF(TYPE(März!$I40)=2,\"\",\"-\"),März!$M40)),0)","v":""},0,{"$f":"April!$A40","v":0},{"$f":"IF(K33<>0,IF(OR(K33=\"So\",K33=\"Sa\"),\"WE\",IF(April!$M40=\"\",IF(TYPE(April!$I40)=2,\"\",\"-\"),April!$M40)),0)","v":0},0,{"$f":"Mai!$A40","v":"So"},{"$f":"IF(N33<>0,IF(OR(N33=\"So\",N33=\"Sa\"),\"WE\",IF(Mai!$M40=\"\",IF(TYPE(Mai!$I40)=2,\"\",\"-\"),Mai!$M40)),0)","v":"WE"},0,{"$f":"Juni!$A40","v":0},{"$f":"IF(Q33<>0,IF(OR(Q33=\"So\",Q33=\"Sa\"),\"WE\",IF(Juni!$M40=\"\",IF(TYPE(Juni!$I40)=2,\"\",\"-\"),Juni!$M40)),0)","v":0},0,{"$f":"Juli!$A40","v":"Fr"},{"$f":"IF(T33<>0,IF(OR(T33=\"So\",T33=\"Sa\"),\"WE\",IF(Juli!$M40=\"\",IF(TYPE(Juli!$I40)=2,\"\",\"-\"),Juli!$M40)),0)","v":""},0,{"$f":"August!$A40","v":"Mo"},{"$f":"IF(W33<>0,IF(OR(W33=\"So\",W33=\"Sa\"),\"WE\",IF(August!$M40=\"\",IF(TYPE(August!$I40)=2,\"\",\"-\"),August!$M40)),0)","v":""},0,{"$f":"September!$A40","v":0},{"$f":"IF(Z33<>0,IF(OR(Z33=\"So\",Z33=\"Sa\"),\"WE\",IF(September!$M40=\"\",IF(TYPE(September!$I40)=2,\"\",\"-\"),September!$M40)),0)","v":0},0,{"$f":"Oktober!$A40","v":"Sa"},{"$f":"IF(AC33<>0,IF(OR(AC33=\"So\",AC33=\"Sa\"),\"WE\",IF(Oktober!$M40=\"\",IF(TYPE(Oktober!$I40)=2,\"\",\"-\"),Oktober!$M40)),0)","v":"WE"},0,{"$f":"November!$A40","v":0},{"$f":"IF(AF33<>0,IF(OR(AF33=\"So\",AF33=\"Sa\"),\"WE\",IF(November!$M40=\"\",IF(TYPE(November!$I40)=2,\"\",\"-\"),November!$M40)),0)","v":0},0,{"$f":"Dezember!$A40","v":"Do"},{"$f":"IF(AI33<>0,IF(OR(AI33=\"So\",AI33=\"Sa\"),\"WE\",IF(Dezember!$M40=\"\",IF(TYPE(Dezember!$I40)=2,\"\",\"-\"),Dezember!$M40)),0)","v":"FT"},0]
[null,{"$f":"Januar!A41","v":0},{"$f":"IF(B34<>0,IF(OR(B34=\"So\",B34=\"Sa\"),\"WE\",IF(Januar!$M41=\"\",IF(TYPE(Januar!$I41)=2,\"\",\"-\"),Januar!$M41)),0)","v":0},{"$f":"IF(OR(C34=\"-\",C34=\"HO/mW\"),1,0)","v":0},{"$f":"Februar!A41","v":0},{"$f":"IF(E34<>0,IF(OR(E34=\"So\",E34=\"Sa\"),\"WE\",IF(Februar!$M41=\"\",IF(TYPE(Februar!$I41)=2,\"\",\"-\"),Februar!$M41)),0)","v":0},{"$f":"IF(OR(F34=\"-\",F34=\"HO/mW\"),1,0)","v":0},{"$f":"März!$A41","v":0},{"$f":"IF(H34<>0,IF(OR(H34=\"So\",H34=\"Sa\"),\"WE\",IF(März!$M41=\"\",IF(TYPE(März!$I41)=2,\"\",\"-\"),März!$M41)),0)","v":0},{"$f":"IF(OR(I34=\"-\",I34=\"HO/mW\"),1,0)","v":0},{"$f":"April!$A41","v":0},{"$f":"IF(K34<>0,IF(OR(K34=\"So\",K34=\"Sa\"),\"WE\",IF(April!$M41=\"\",IF(TYPE(April!$I41)=2,\"\",\"-\"),April!$M41)),0)","v":0},{"$f":"IF(OR(L34=\"-\",L34=\"HO/mW\"),1,0)","v":0},{"$f":"Mai!$A41","v":0},{"$f":"IF(N34<>0,IF(OR(N34=\"So\",N34=\"Sa\"),\"WE\",IF(Mai!$M41=\"\",IF(TYPE(Mai!$I41)=2,\"\",\"-\"),Mai!$M41)),0)","v":0},{"$f":"IF(OR(O34=\"-\",O34=\"HO/mW\"),1,0)","v":0},{"$f":"Juni!$A41","v":0},{"$f":"IF(Q34<>0,IF(OR(Q34=\"So\",Q34=\"Sa\"),\"WE\",IF(Juni!$M41=\"\",IF(TYPE(Juni!$I41)=2,\"\",\"-\"),Juni!$M41)),0)","v":0},{"$f":"IF(OR(R34=\"-\",R34=\"HO/mW\"),1,0)","v":0},{"$f":"Juli!$A41","v":0},{"$f":"IF(T34<>0,IF(OR(T34=\"So\",T34=\"Sa\"),\"WE\",IF(Juli!$M41=\"\",IF(TYPE(Juli!$I41)=2,\"\",\"-\"),Juli!$M41)),0)","v":0},{"$f":"IF(OR(U34=\"-\",U34=\"HO/mW\"),1,0)","v":0},{"$f":"August!$A41","v":0},{"$f":"IF(W34<>0,IF(OR(W34=\"So\",W34=\"Sa\"),\"WE\",IF(August!$M41=\"\",IF(TYPE(August!$I41)=2,\"\",\"-\"),August!$M41)),0)","v":0},{"$f":"IF(OR(X34=\"-\",X34=\"HO/mW\"),1,0)","v":0},{"$f":"September!$A41","v":0},{"$f":"IF(Z34<>0,IF(OR(Z34=\"So\",Z34=\"Sa\"),\"WE\",IF(September!$M41=\"\",IF(TYPE(September!$I41)=2,\"\",\"-\"),September!$M41)),0)","v":0},{"$f":"IF(OR(AA34=\"-\",AA34=\"HO/mW\"),1,0)","v":0},{"$f":"Oktober!$A41","v":0},{"$f":"IF(AC34<>0,IF(OR(AC34=\"So\",AC34=\"Sa\"),\"WE\",IF(Oktober!$M41=\"\",IF(TYPE(Oktober!$I41)=2,\"\",\"-\"),Oktober!$M41)),0)","v":0},{"$f":"IF(OR(AD34=\"-\",AD34=\"HO/mW\"),1,0)","v":0},{"$f":"November!$A41","v":0},{"$f":"IF(AF34<>0,IF(OR(AF34=\"So\",AF34=\"Sa\"),\"WE\",IF(November!$M41=\"\",IF(TYPE(November!$I41)=2,\"\",\"-\"),November!$M41)),0)","v":0},{"$f":"IF(OR(AG34=\"-\",AG34=\"HO/mW\"),1,0)","v":0},{"$f":"Dezember!$A41","v":0},{"$f":"IF(AI34<>0,IF(OR(AI34=\"So\",AI34=\"Sa\"),\"WE\",IF(Dezember!$M41=\"\",IF(TYPE(Dezember!$I41)=2,\"\",\"-\"),Dezember!$M41)),0)","v":0},{"$f":"IF(OR(AJ34=\"-\",AJ34=\"HO/mW\"),1,0)","v":0}]
[null,{"$f":"Januar!A42","v":0},{"$f":"IF(B35<>0,IF(OR(B35=\"So\",B35=\"Sa\"),\"WE\",IF(Januar!$M42=\"\",IF(TYPE(Januar!$I42)=2,\"\",\"-\"),Januar!$M42)),0)","v":0},{"$f":"IF(OR(C35=\"K\",C35=\"SD/SS\",C35=\"GT\",C35=\"-\",C35=\"HO/mW\"),1,0)","v":0},{"$f":"Februar!A42","v":0},{"$f":"IF(E35<>0,IF(OR(E35=\"So\",E35=\"Sa\"),\"WE\",IF(Februar!$M42=\"\",IF(TYPE(Februar!$I42)=2,\"\",\"-\"),Februar!$M42)),0)","v":0},{"$f":"IF(OR(F35=\"K\",F35=\"SD/SS\",F35=\"GT\",F35=\"-\",F35=\"HO/mW\"),1,0)","v":0},{"$f":"März!$A42","v":0},{"$f":"IF(H35<>0,IF(OR(H35=\"So\",H35=\"Sa\"),\"WE\",IF(März!$M42=\"\",IF(TYPE(März!$I42)=2,\"\",\"-\"),März!$M42)),0)","v":0},{"$f":"IF(OR(I35=\"K\",I35=\"SD/SS\",I35=\"GT\",I35=\"-\",I35=\"HO/mW\"),1,0)","v":0},{"$f":"April!$A42","v":0},{"$f":"IF(K35<>0,IF(OR(K35=\"So\",K35=\"Sa\"),\"WE\",IF(April!$M42=\"\",IF(TYPE(April!$I42)=2,\"\",\"-\"),April!$M42)),0)","v":0},{"$f":"IF(OR(L35=\"K\",L35=\"SD/SS\",L35=\"GT\",L35=\"-\",L35=\"HO/mW\"),1,0)","v":0},{"$f":"Mai!$A42","v":0},{"$f":"IF(N35<>0,IF(OR(N35=\"So\",N35=\"Sa\"),\"WE\",IF(Mai!$M42=\"\",IF(TYPE(Mai!$I42)=2,\"\",\"-\"),Mai!$M42)),0)","v":0},{"$f":"IF(OR(O35=\"K\",O35=\"SD/SS\",O35=\"GT\",O35=\"-\",O35=\"HO/mW\"),1,0)","v":0},{"$f":"Juni!$A42","v":0},{"$f":"IF(Q35<>0,IF(OR(Q35=\"So\",Q35=\"Sa\"),\"WE\",IF(Juni!$M42=\"\",IF(TYPE(Juni!$I42)=2,\"\",\"-\"),Juni!$M42)),0)","v":0},{"$f":"IF(OR(R35=\"K\",R35=\"SD/SS\",R35=\"GT\",R35=\"-\",R35=\"HO/mW\"),1,0)","v":0},{"$f":"Juli!$A42","v":0},{"$f":"IF(T35<>0,IF(OR(T35=\"So\",T35=\"Sa\"),\"WE\",IF(Juli!$M42=\"\",IF(TYPE(Juli!$I42)=2,\"\",\"-\"),Juli!$M42)),0)","v":0},{"$f":"IF(OR(U35=\"K\",U35=\"SD/SS\",U35=\"GT\",U35=\"-\",U35=\"HO/mW\"),1,0)","v":0},{"$f":"August!$A42","v":0},{"$f":"IF(W35<>0,IF(OR(W35=\"So\",W35=\"Sa\"),\"WE\",IF(August!$M42=\"\",IF(TYPE(August!$I42)=2,\"\",\"-\"),August!$M42)),0)","v":0},{"$f":"IF(OR(X35=\"K\",X35=\"SD/SS\",X35=\"GT\",X35=\"-\",X35=\"HO/mW\"),1,0)","v":0},{"$f":"September!$A42","v":0},{"$f":"IF(Z35<>0,IF(OR(Z35=\"So\",Z35=\"Sa\"),\"WE\",IF(September!$M42=\"\",IF(TYPE(September!$I42)=2,\"\",\"-\"),September!$M42)),0)","v":0},{"$f":"IF(OR(AA35=\"K\",AA35=\"SD/SS\",AA35=\"GT\",AA35=\"-\",AA35=\"HO/mW\"),1,0)","v":0},{"$f":"Oktober!$A42","v":0},{"$f":"IF(AC35<>0,IF(OR(AC35=\"So\",AC35=\"Sa\"),\"WE\",IF(Oktober!$M42=\"\",IF(TYPE(Oktober!$I42)=2,\"\",\"-\"),Oktober!$M42)),0)","v":0},{"$f":"IF(OR(AD35=\"K\",AD35=\"SD/SS\",AD35=\"GT\",AD35=\"-\",AD35=\"HO/mW\"),1,0)","v":0},{"$f":"November!$A42","v":0},{"$f":"IF(AF35<>0,IF(OR(AF35=\"So\",AF35=\"Sa\"),\"WE\",IF(November!$M42=\"\",IF(TYPE(November!$I42)=2,\"\",\"-\"),November!$M42)),0)","v":0},{"$f":"IF(OR(AG35=\"K\",AG35=\"SD/SS\",AG35=\"GT\",AG35=\"-\",AG35=\"HO/mW\"),1,0)","v":0},{"$f":"Dezember!$A42","v":0},{"$f":"IF(AI35<>0,IF(OR(AI35=\"So\",AI35=\"Sa\"),\"WE\",IF(Dezember!$M42=\"\",IF(TYPE(Dezember!$I42)=2,\"\",\"-\"),Dezember!$M42)),0)","v":0},{"$f":"IF(OR(AJ35=\"K\",AJ35=\"SD/SS\",AJ35=\"GT\",AJ35=\"-\",AJ35=\"HO/mW\"),1,0)","v":0}]
[null,null,{"$f":"COUNTIF(C3:C35,\"HO/mW\")","v":0},{"$f":"SUM(D3:D35)","v":3},null,{"$f":"COUNTIF(F3:F35,\"HO/mW\")","v":0},{"$f":"SUM(G3:G35)","v":0},null,{"$f":"COUNTIF(I3:I35,\"HO/mW\")","v":0},{"$f":"SUM(J3:J35)","v":0},null,{"$f":"COUNTIF(L3:L35,\"HO/mW\")","v":0},{"$f":"SUM(M3:M35)","v":0},null,{"$f":"COUNTIF(O3:O35,\"HO/mW\")","v":0},{"$f":"SUM(P3:P35)","v":0},null,{"$f":"COUNTIF(R3:R35,\"HO/mW\")","v":0},{"$f":"SUM(S3:S35)","v":0},null,{"$f":"COUNTIF(U3:U35,\"HO/mW\")","v":0},{"$f":"SUM(V3:V35)","v":0},null,{"$f":"COUNTIF(X3:X35,\"HO/mW\")","v":0},{"$f":"SUM(Y3:Y35)","v":0},null,{"$f":"COUNTIF(AA3:AA35,\"HO/mW\")","v":0},{"$f":"SUM(AB3:AB35)","v":0},null,{"$f":"COUNTIF(AD3:AD35,\"HO/mW\")","v":0},{"$f":"SUM(AE3:AE35)","v":0},null,{"$f":"COUNTIF(AG3:AG35,\"HO/mW\")","v":0},{"$f":"SUM(AH3:AH35)","v":0},null,{"$f":"COUNTIF(AJ3:AJ35,\"HO/mW\")","v":0},{"$f":"SUM(AK3:AK35)","v":0}]
["HO/mW","mW",{"$f":"IF(D36>0,ROUND(100*C36/D36,2),)","v":0},"%","mW",{"$f":"IF(G36>0,ROUND(100*F36/G36,2),)","v":0},"%","mW",{"$f":"IF(J36>0,ROUND(100*I36/J36,2),)","v":0},null,"mW",{"$f":"IF(M36>0,ROUND(100*L36/M36,2),)","v":0},null,"mW",{"$f":"IF(P36>0,ROUND(100*O36/P36,2),)","v":0},null,"mW",{"$f":"IF(S36>0,ROUND(100*R36/S36,2),)","v":0},null,"mW",{"$f":"IF(V36>0,ROUND(100*U36/V36,2),)","v":0},null,"mW",{"$f":"IF(Y36>0,ROUND(100*X36/Y36,2),)","v":0},null,"mW",{"$f":"IF(AB36>0,ROUND(100*AA36/AB36,2),)","v":0},null,"mW",{"$f":"IF(AE36>0,ROUND(100*AD36/AE36,2),)","v":0},null,"mW",{"$f":"IF(AH36>0,ROUND(100*AG36/AH36,2),)","v":0},null,"mW",{"$f":"IF(AK36>0,ROUND(100*AJ36/AK36,2),)","v":0}]
[null,{"$f":"IF(SUM(D36,G36,J36,M36,P36,S36,V36,Y36,AB36,AE36,AH36,AK36)>0,SUM(C36,F36,I36,L36,O36,R36,U36,X36,AA36,AD36,AG36,AJ36)/SUM(D36,G36,J36,M36,P36,S36,V36,Y36,AB36,AE36,AH36,AK36),0)","v":0}]
[null,null,{"$f":"COUNTIF(C3:C33,\"-\")","v":3},null,null,{"$f":"COUNTIF(F3:F33,\"-\")","v":0},null,null,{"$f":"COUNTIF(I3:I33,\"-\")","v":0},null,null,{"$f":"COUNTIF(L3:L33,\"-\")","v":0},null,null,{"$f":"COUNTIF(O3:O33,\"-\")","v":0},null,null,{"$f":"COUNTIF(R3:R33,\"-\")","v":0},null,null,{"$f":"COUNTIF(U3:U33,\"-\")","v":0},null,null,{"$f":"COUNTIF(X3:X33,\"-\")","v":0},null,null,{"$f":"COUNTIF(AA3:AA33,\"-\")","v":0},null,null,{"$f":"COUNTIF(AD3:AD33,\"-\")","v":0},null,null,{"$f":"COUNTIF(AG3:AG33,\"-\")","v":0},null,null,{"$f":"COUNTIF(AJ3:AJ33,\"-\")","v":0}]
["am SO",null,{"$f":"IF(D36=0,0,C39/D36)","v":1},null,null,{"$f":"IF(G36=0,0,F39/G36)","v":0},null,null,{"$f":"IF(J36=0,0,I39/J36)","v":0},null,null,{"$f":"IF(M36=0,0,L39/M36)","v":0},null,null,{"$f":"IF(P36=0,0,O39/P36)","v":0},null,null,{"$f":"IF(S36=0,0,R39/S36)","v":0},null,null,{"$f":"IF(V36=0,0,U39/V36)","v":0},null,null,{"$f":"IF(Y36=0,0,X39/Y36)","v":0},null,null,{"$f":"IF(AB36=0,0,AA39/AB36)","v":0},null,null,{"$f":"IF(AE36=0,0,AD39/AE36)","v":0},null,null,{"$f":"IF(AH36=0,0,AG39/AH36)","v":0},null,null,{"$f":"IF(AK36=0,0,AJ39/AK36)","v":0}]
[]
[]
[]
[]
[null,null,{"$f":"IF(B37=\"mW\",45,80)","v":45},null,null,{"$f":"IF(E37=\"mW\",45,80)","v":45},null,null,{"$f":"IF(H37=\"mW\",45,80)","v":45},null,null,{"$f":"IF(K37=\"mW\",45,80)","v":45},null,null,{"$f":"IF(N37=\"mW\",45,80)","v":45},null,null,{"$f":"IF(Q37=\"mW\",45,80)","v":45},null,null,{"$f":"IF(T37=\"mW\",45,80)","v":45},null,null,{"$f":"IF(W37=\"mW\",45,80)","v":45},null,null,{"$f":"IF(Z37=\"mW\",45,80)","v":45},null,null,{"$f":"IF(AC37=\"mW\",45,80)","v":45},null,null,{"$f":"IF(AF37=\"mW\",45,80)","v":45},null,null,{"$f":"IF(AI37=\"mW\",45,80)","v":45}]
[]
[]
[null,null,"alt:","IF(OR(C34=\"K\";C34=\"SD/SS\";C34=\"GT\";C34=\"-\";C34=\"HO/mW\");1;0)"]
[null,null,"neu:","IF(OR(C34=\"-\";C34=\"HO/mW\");1;0)"]

{"sheet":"HomeOffice","index":14,"n_rows":37,"n_cols":37,"rows_kept":37,"cut":false,"hidden":true,"merged":[[1,34,1,36],[1,1,1,3],[1,4,1,6],[1,7,1,9],[1,10,1,12],[1,13,1,15],[1,16,1,18],[1,19,1,21],[1,22,1,24],[1,25,1,27],[1,28,1,30],[1,31,1,33]]}
[]
[null,"Januar",null,null,"Februar",null,null,"März",null,null,"April",null,null,"Mai",null,null,"Juni",null,null,"Juli",null,null,"August",null,null,"September",null,null,"Oktober",null,null,"November",null,null,"Dezember"]
[null,{"$f":"Januar!A10","v":"Do"},{"$f":"IF(B3<>0,IF(OR(B3=\"So\",B3=\"Sa\"),\"WE\",IF(Januar!M10=\"\",\"-\",Januar!M10)),0)","v":"U"},{"$f":"IF(OR(C3=\"K\",C3=\"SD\",C3=\"GT\",C3=\"-\",C3=\"HO\"),1,0)","v":0},{"$f":"Februar!$A10","v":"So"},{"$f":"IF(E3<>0,IF(OR(E3=\"So\",E3=\"Sa\"),\"WE\",IF(Februar!M10=\"\",\"-\",Februar!M10)),0)","v":"WE"},{"$f":"IF(OR(F3=\"K\",F3=\"SD\",F3=\"GT\",F3=\"-\",F3=\"HO\"),1,0)","v":0},{"$f":"März!$A10","v":"So"},{"$f":"IF(H3<>0,IF(OR(H3=\"So\",H3=\"Sa\"),\"WE\",IF(März!$M10=\"\",\"-\",März!$M10)),0)","v":"WE"},{"$f":"IF(OR(I3=\"K\",I3=\"SD\",I3=\"GT\",I3=\"-\",I3=\"HO\"),1,0)","v":0},{"$f":"April!$A10","v":"Mi"},{"$f":"IF(K3<>0,IF(OR(K3=\"So\",K3=\"Sa\"),\"WE\",IF(April!$M10=\"\",\"-\",April!$M10)),0)","v":"-"},{"$f":"IF(OR(L3=\"K\",L3=\"SD\",L3=\"GT\",L3=\"-\",L3=\"HO\"),1,0)","v":1},{"$f":"Mai!$A10","v":"Fr"},{"$f":"IF(N3<>0,IF(OR(N3=\"So\",N3=\"Sa\"),\"WE\",IF(Mai!$M10=\"\",\"-\",Mai!$M10)),0)","v":"FT"},{"$f":"IF(OR(O3=\"K\",O3=\"SD\",O3=\"GT\",O3=\"-\",O3=\"HO\"),1,0)","v":0},{"$f":"Juni!$A10","v":"Mo"},{"$f":"IF(Q3<>0,IF(OR(Q3=\"So\",Q3=\"Sa\"),\"WE\",IF(Juni!$M10=\"\",\"-\",Juni!$M10)),0)","v":"-"},{"$f":"IF(OR(R3=\"K\",R3=\"SD\",R3=\"GT\",R3=\"-\",R3=\"HO\"),1,0)","v":1},{"$f":"Juli!$A10","v":"Mi"},{"$f":"IF(T3<>0,IF(OR(T3=\"So\",T3=\"Sa\"),\"WE\",IF(Juli!$M10=\"\",\"-\",Juli!$M10)),0)","v":"-"},{"$f":"IF(OR(U3=\"K\",U3=\"SD\",U3=\"GT\",U3=\"-\",U3=\"HO\"),1,0)","v":1},{"$f":"August!$A10","v":"Sa"},{"$f":"IF(W3<>0,IF(OR(W3=\"So\",W3=\"Sa\"),\"WE\",IF(August!$M10=\"\",\"-\",August!$M10)),0)","v":"WE"},{"$f":"IF(OR(X3=\"K\",X3=\"SD\",X3=\"GT\",X3=\"-\",X3=\"HO\"),1,0)","v":0},{"$f":"September!$A10","v":"Di"},{"$f":"IF(Z3<>0,IF(OR(Z3=\"So\",Z3=\"Sa\"),\"WE\",IF(September!$M10=\"\",\"-\",September!$M10)),0)","v":"-"},{"$f":"IF(OR(AA3=\"K\",AA3=\"SD\",AA3=\"GT\",AA3=\"-\",AA3=\"HO\"),1,0)","v":1},{"$f":"Oktober!$A10","v":"Do"},{"$f":"IF(AC3<>0,IF(OR(AC3=\"So\",AC3=\"Sa\"),\"WE\",IF(Oktober!$M10=\"\",\"-\",Oktober!$M10)),0)","v":"-"},{"$f":"IF(OR(AD3=\"K\",AD3=\"SD\",AD3=\"GT\",AD3=\"-\",AD3=\"HO\"),1,0)","v":1},{"$f":"November!$A10","v":"So"},{"$f":"IF(AF3<>0,IF(OR(AF3=\"So\",AF3=\"Sa\"),\"WE\",IF(November!$M10=\"\",\"-\",November!$M10)),0)","v":"WE"},{"$f":"IF(OR(AG3=\"K\",AG3=\"SD\",AG3=\"GT\",AG3=\"-\",AG3=\"HO\"),1,0)","v":0},{"$f":"Dezember!$A10","v":"Di"},{"$f":"IF(AI3<>0,IF(OR(AI3=\"So\",AI3=\"Sa\"),\"WE\",IF(Dezember!$M10=\"\",\"-\",Dezember!$M10)),0)","v":"-"},{"$f":"IF(OR(AJ3=\"K\",AJ3=\"SD\",AJ3=\"GT\",AJ3=\"-\",AJ3=\"HO\"),1,0)","v":1}]
[null,{"$f":"Januar!A11","v":"Fr"},{"$f":"IF(B4<>0,IF(OR(B4=\"So\",B4=\"Sa\"),\"WE\",IF(Januar!M11=\"\",\"-\",Januar!M11)),0)","v":"U"},0,{"$f":"Februar!A11","v":"Mo"},{"$f":"IF(E4<>0,IF(OR(E4=\"So\",E4=\"Sa\"),\"WE\",IF(Februar!M11=\"\",\"-\",Februar!M11)),0)","v":"-"},1,{"$f":"März!$A11","v":"Mo"},{"$f":"IF(H4<>0,IF(OR(H4=\"So\",H4=\"Sa\"),\"WE\",IF(März!$M11=\"\",\"-\",März!$M11)),0)","v":"-"},1,{"$f":"April!$A11","v":"Do"},{"$f":"IF(K4<>0,IF(OR(K4=\"So\",K4=\"Sa\"),\"WE\",IF(April!$M11=\"\",\"-\",April!$M11)),0)","v":"-"},1,{"$f":"Mai!$A11","v":"Sa"},{"$f":"IF(N4<>0,IF(OR(N4=\"So\",N4=\"Sa\"),\"WE\",IF(Mai!$M11=\"\",\"-\",Mai!$M11)),0)","v":"WE"},0,{"$f":"Juni!$A11","v":"Di"},{"$f":"IF(Q4<>0,IF(OR(Q4=\"So\",Q4=\"Sa\"),\"WE\",IF(Juni!$M11=\"\",\"-\",Juni!$M11)),0)","v":"-"},1,{"$f":"Juli!$A11","v":"Do"},{"$f":"IF(T4<>0,IF(OR(T4=\"So\",T4=\"Sa\"),\"WE\",IF(Juli!$M11=\"\",\"-\",Juli!$M11)),0)","v":"-"},1,{"$f":"August!$A11","v":"So"},{"$f":"IF(W4<>0,IF(OR(W4=\"So\",W4=\"Sa\"),\"WE\",IF(August!$M11=\"\",\"-\",August!$M11)),0)","v":"WE"},0,{"$f":"September!$A11","v":"Mi"},{"$f":"IF(Z4<>0,IF(OR(Z4=\"So\",Z4=\"Sa\"),\"WE\",IF(September!$M11=\"\",\"-\",September!$M11)),0)","v":"-"},1,{"$f":"Oktober!$A11","v":"Fr"},{"$f":"IF(AC4<>0,IF(OR(AC4=\"So\",AC4=\"Sa\"),\"WE\",IF(Oktober!$M11=\"\",\"-\",Oktober!$M11)),0)","v":"-"},1,{"$f":"November!$A11","v":"Mo"},{"$f":"IF(AF4<>0,IF(OR(AF4=\"So\",AF4=\"Sa\"),\"WE\",IF(November!$M11=\"\",\"-\",November!$M11)),0)","v":"-"},1,{"$f":"Dezember!$A11","v":"Mi"},{"$f":"IF(AI4<>0,IF(OR(AI4=\"So\",AI4=\"Sa\"),\"WE\",IF(Dezember!$M11=\"\",\"-\",Dezember!$M11)),0)","v":"-"},1]
[null,{"$f":"Januar!A12","v":"Sa"},{"$f":"IF(B5<>0,IF(OR(B5=\"So\",B5=\"Sa\"),\"WE\",IF(Januar!M12=\"\",\"-\",Januar!M12)),0)","v":"WE"},0,{"$f":"Februar!A12","v":"Di"},{"$f":"IF(E5<>0,IF(OR(E5=\"So\",E5=\"Sa\"),\"WE\",IF(Februar!M12=\"\",\"-\",Februar!M12)),0)","v":"-"},1,{"$f":"März!$A12","v":"Di"},{"$f":"IF(H5<>0,IF(OR(H5=\"So\",H5=\"Sa\"),\"WE\",IF(März!$M12=\"\",\"-\",März!$M12)),0)","v":"-"},1,{"$f":"April!$A12","v":"Fr"},{"$f":"IF(K5<>0,IF(OR(K5=\"So\",K5=\"Sa\"),\"WE\",IF(April!$M12=\"\",\"-\",April!$M12)),0)","v":"FT"},0,{"$f":"Mai!$A12","v":"So"},{"$f":"IF(N5<>0,IF(OR(N5=\"So\",N5=\"Sa\"),\"WE\",IF(Mai!$M12=\"\",\"-\",Mai!$M12)),0)","v":"WE"},0,{"$f":"Juni!$A12","v":"Mi"},{"$f":"IF(Q5<>0,IF(OR(Q5=\"So\",Q5=\"Sa\"),\"WE\",IF(Juni!$M12=\"\",\"-\",Juni!$M12)),0)","v":"-"},1,{"$f":"Juli!$A12","v":"Fr"},{"$f":"IF(T5<>0,IF(OR(T5=\"So\",T5=\"Sa\"),\"WE\",IF(Juli!$M12=\"\",\"-\",Juli!$M12)),0)","v":"-"},1,{"$f":"August!$A12","v":"Mo"},{"$f":"IF(W5<>0,IF(OR(W5=\"So\",W5=\"Sa\"),\"WE\",IF(August!$M12=\"\",\"-\",August!$M12)),0)","v":"-"},1,{"$f":"September!$A12","v":"Do"},{"$f":"IF(Z5<>0,IF(OR(Z5=\"So\",Z5=\"Sa\"),\"WE\",IF(September!$M12=\"\",\"-\",September!$M12)),0)","v":"-"},1,{"$f":"Oktober!$A12","v":"Sa"},{"$f":"IF(AC5<>0,IF(OR(AC5=\"So\",AC5=\"Sa\"),\"WE\",IF(Oktober!$M12=\"\",\"-\",Oktober!$M12)),0)","v":"WE"},0,{"$f":"November!$A12","v":"Di"},{"$f":"IF(AF5<>0,IF(OR(AF5=\"So\",AF5=\"Sa\"),\"WE\",IF(November!$M12=\"\",\"-\",November!$M12)),0)","v":"-"},1,{"$f":"Dezember!$A12","v":"Do"},{"$f":"IF(AI5<>0,IF(OR(AI5=\"So\",AI5=\"Sa\"),\"WE\",IF(Dezember!$M12=\"\",\"-\",Dezember!$M12)),0)","v":"-"},1]
[null,{"$f":"Januar!A13","v":"So"},{"$f":"IF(B6<>0,IF(OR(B6=\"So\",B6=\"Sa\"),\"WE\",IF(Januar!M13=\"\",\"-\",Januar!M13)),0)","v":"WE"},0,{"$f":"Februar!A13","v":"Mi"},{"$f":"IF(E6<>0,IF(OR(E6=\"So\",E6=\"Sa\"),\"WE\",IF(Februar!M13=\"\",\"-\",Februar!M13)),0)","v":"-"},1,{"$f":"März!$A13","v":"Mi"},{"$f":"IF(H6<>0,IF(OR(H6=\"So\",H6=\"Sa\"),\"WE\",IF(März!$M13=\"\",\"-\",März!$M13)),0)","v":"-"},1,{"$f":"April!$A13","v":"Sa"},{"$f":"IF(K6<>0,IF(OR(K6=\"So\",K6=\"Sa\"),\"WE\",IF(April!$M13=\"\",\"-\",April!$M13)),0)","v":"WE"},0,{"$f":"Mai!$A13","v":"Mo"},{"$f":"IF(N6<>0,IF(OR(N6=\"So\",N6=\"Sa\"),\"WE\",IF(Mai!$M13=\"\",\"-\",Mai!$M13)),0)","v":"-"},1,{"$f":"Juni!$A13","v":"Do"},{"$f":"IF(Q6<>0,IF(OR(Q6=\"So\",Q6=\"Sa\"),\"WE\",IF(Juni!$M13=\"\",\"-\",Juni!$M13)),0)","v":"FT"},0,{"$f":"Juli!$A13","v":"Sa"},{"$f":"IF(T6<>0,IF(OR(T6=\"So\",T6=\"Sa\"),\"WE\",IF(Juli!$M13=\"\",\"-\",Juli!$M13)),0)","v":"WE"},0,{"$f":"August!$A13","v":"Di"},{"$f":"IF(W6<>0,IF(OR(W6=\"So\",W6=\"Sa\"),\"WE\",IF(August!$M13=\"\",\"-\",August!$M13)),0)","v":"-"},1,{"$f":"September!$A13","v":"Fr"},{"$f":"IF(Z6<>0,IF(OR(Z6=\"So\",Z6=\"Sa\"),\"WE\",IF(September!$M13=\"\",\"-\",September!$M13)),0)","v":"-"},1,{"$f":"Oktober!$A13","v":"So"},{"$f":"IF(AC6<>0,IF(OR(AC6=\"So\",AC6=\"Sa\"),\"WE\",IF(Oktober!$M13=\"\",\"-\",Oktober!$M13)),0)","v":"WE"},0,{"$f":"November!$A13","v":"Mi"},{"$f":"IF(AF6<>0,IF(OR(AF6=\"So\",AF6=\"Sa\"),\"WE\",IF(November!$M13=\"\",\"-\",November!$M13)),0)","v":"-"},1,{"$f":"Dezember!$A13","v":"Fr"},{"$f":"IF(AI6<>0,IF(OR(AI6=\"So\",AI6=\"Sa\"),\"WE\",IF(Dezember!$M13=\"\",\"-\",Dezember!$M13)),0)","v":"-"},1]
[null,{"$f":"Januar!A14","v":"Mo"},{"$f":"IF(B7<>0,IF(OR(B7=\"So\",B7=\"Sa\"),\"WE\",IF(Januar!M14=\"\",\"-\",Januar!M14)),0)","v":"U"},0,{"$f":"Februar!A14","v":"Do"},{"$f":"IF(E7<>0,IF(OR(E7=\"So\",E7=\"Sa\"),\"WE\",IF(Februar!M14=\"\",\"-\",Februar!M14)),0)","v":"-"},1,{"$f":"März!$A14","v":"Do"},{"$f":"IF(H7<>0,IF(OR(H7=\"So\",H7=\"Sa\"),\"WE\",IF(März!$M14=\"\",\"-\",März!$M14)),0)","v":"-"},1,{"$f":"April!$A14","v":"So"},{"$f":"IF(K7<>0,IF(OR(K7=\"So\",K7=\"Sa\"),\"WE\",IF(April!$M14=\"\",\"-\",April!$M14)),0)","v":"WE"},0,{"$f":"Mai!$A14","v":"Di"},{"$f":"IF(N7<>0,IF(OR(N7=\"So\",N7=\"Sa\"),\"WE\",IF(Mai!$M14=\"\",\"-\",Mai!$M14)),0)","v":"-"},1,{"$f":"Juni!$A14","v":"Fr"},{"$f":"IF(Q7<>0,IF(OR(Q7=\"So\",Q7=\"Sa\"),\"WE\",IF(Juni!$M14=\"\",\"-\",Juni!$M14)),0)","v":"-"},1,{"$f":"Juli!$A14","v":"So"},{"$f":"IF(T7<>0,IF(OR(T7=\"So\",T7=\"Sa\"),\"WE\",IF(Juli!$M14=\"\",\"-\",Juli!$M14)),0)","v":"WE"},0,{"$f":"August!$A14","v":"Mi"},{"$f":"IF(W7<>0,IF(OR(W7=\"So\",W7=\"Sa\"),\"WE\",IF(August!$M14=\"\",\"-\",August!$M14)),0)","v":"-"},1,{"$f":"September!$A14","v":"Sa"},{"$f":"IF(Z7<>0,IF(OR(Z7=\"So\",Z7=\"Sa\"),\"WE\",IF(September!$M14=\"\",\"-\",September!$M14)),0)","v":"WE"},0,{"$f":"Oktober!$A14","v":"Mo"},{"$f":"IF(AC7<>0,IF(OR(AC7=\"So\",AC7=\"Sa\"),\"WE\",IF(Oktober!$M14=\"\",\"-\",Oktober!$M14)),0)","v":"-"},1,{"$f":"November!$A14","v":"Do"},{"$f":"IF(AF7<>0,IF(OR(AF7=\"So\",AF7=\"Sa\"),\"WE\",IF(November!$M14=\"\",\"-\",November!$M14)),0)","v":"-"},1,{"$f":"Dezember!$A14","v":"Sa"},{"$f":"IF(AI7<>0,IF(OR(AI7=\"So\",AI7=\"Sa\"),\"WE\",IF(Dezember!$M14=\"\",\"-\",Dezember!$M14)),0)","v":"WE"},0]
[null,{"$f":"Januar!A15","v":"Di"},{"$f":"IF(B8<>0,IF(OR(B8=\"So\",B8=\"Sa\"),\"WE\",IF(Januar!M15=\"\",\"-\",Januar!M15)),0)","v":"-"},1,{"$f":"Februar!A15","v":"Fr"},{"$f":"IF(E8<>0,IF(OR(E8=\"So\",E8=\"Sa\"),\"WE\",IF(Februar!M15=\"\",\"-\",Februar!M15)),0)","v":"-"},1,{"$f":"März!$A15","v":"Fr"},{"$f":"IF(H8<>0,IF(OR(H8=\"So\",H8=\"Sa\"),\"WE\",IF(März!$M15=\"\",\"-\",März!$M15)),0)","v":"-"},1,{"$f":"April!$A15","v":"Mo"},{"$f":"IF(K8<>0,IF(OR(K8=\"So\",K8=\"Sa\"),\"WE\",IF(April!$M15=\"\",\"-\",April!$M15)),0)","v":"FT"},0,{"$f":"Mai!$A15","v":"Mi"},{"$f":"IF(N8<>0,IF(OR(N8=\"So\",N8=\"Sa\"),\"WE\",IF(Mai!$M15=\"\",\"-\",Mai!$M15)),0)","v":"-"},1,{"$f":"Juni!$A15","v":"Sa"},{"$f":"IF(Q8<>0,IF(OR(Q8=\"So\",Q8=\"Sa\"),\"WE\",IF(Juni!$M15=\"\",\"-\",Juni!$M15)),0)","v":"WE"},0,{"$f":"Juli!$A15","v":"Mo"},{"$f":"IF(T8<>0,IF(OR(T8=\"So\",T8=\"Sa\"),\"WE\",IF(Juli!$M15=\"\",\"-\",Juli!$M15)),0)","v":"-"},1,{"$f":"August!$A15","v":"Do"},{"$f":"IF(W8<>0,IF(OR(W8=\"So\",W8=\"Sa\"),\"WE\",IF(August!$M15=\"\",\"-\",August!$M15)),0)","v":"-"},1,{"$f":"September!$A15","v":"So"},{"$f":"IF(Z8<>0,IF(OR(Z8=\"So\",Z8=\"Sa\"),\"WE\",IF(September!$M15=\"\",\"-\",September!$M15)),0)","v":"WE"},0,{"$f":"Oktober!$A15","v":"Di"},{"$f":"IF(AC8<>0,IF(OR(AC8=\"So\",AC8=\"Sa\"),\"WE\",IF(Oktober!$M15=\"\",\"-\",Oktober!$M15)),0)","v":"-"},1,{"$f":"November!$A15","v":"Fr"},{"$f":"IF(AF8<>0,IF(OR(AF8=\"So\",AF8=\"Sa\"),\"WE\",IF(November!$M15=\"\",\"-\",November!$M15)),0)","v":"-"},1,{"$f":"Dezember!$A15","v":"So"},{"$f":"IF(AI8<>0,IF(OR(AI8=\"So\",AI8=\"Sa\"),\"WE\",IF(Dezember!$M15=\"\",\"-\",Dezember!$M15)),0)","v":"WE"},0]
[null,{"$f":"Januar!A16","v":"Mi"},{"$f":"IF(B9<>0,IF(OR(B9=\"So\",B9=\"Sa\"),\"WE\",IF(Januar!M16=\"\",\"-\",Januar!M16)),0)","v":"-"},1,{"$f":"Februar!A16","v":"Sa"},{"$f":"IF(E9<>0,IF(OR(E9=\"So\",E9=\"Sa\"),\"WE\",IF(Februar!M16=\"\",\"-\",Februar!M16)),0)","v":"WE"},0,{"$f":"März!$A16","v":"Sa"},{"$f":"IF(H9<>0,IF(OR(H9=\"So\",H9=\"Sa\"),\"WE\",IF(März!$M16=\"\",\"-\",März!$M16)),0)","v":"WE"},0,{"$f":"April!$A16","v":"Di"},{"$f":"IF(K9<>0,IF(OR(K9=\"So\",K9=\"Sa\"),\"WE\",IF(April!$M16=\"\",\"-\",April!$M16)),0)","v":"-"},1,{"$f":"Mai!$A16","v":"Do"},{"$f":"IF(N9<>0,IF(OR(N9=\"So\",N9=\"Sa\"),\"WE\",IF(Mai!$M16=\"\",\"-\",Mai!$M16)),0)","v":"-"},1,{"$f":"Juni!$A16","v":"So"},{"$f":"IF(Q9<>0,IF(OR(Q9=\"So\",Q9=\"Sa\"),\"WE\",IF(Juni!$M16=\"\",\"-\",Juni!$M16)),0)","v":"WE"},0,{"$f":"Juli!$A16","v":"Di"},{"$f":"IF(T9<>0,IF(OR(T9=\"So\",T9=\"Sa\"),\"WE\",IF(Juli!$M16=\"\",\"-\",Juli!$M16)),0)","v":"-"},1,{"$f":"August!$A16","v":"Fr"},{"$f":"IF(W9<>0,IF(OR(W9=\"So\",W9=\"Sa\"),\"WE\",IF(August!$M16=\"\",\"-\",August!$M16)),0)","v":"-"},1,{"$f":"September!$A16","v":"Mo"},{"$f":"IF(Z9<>0,IF(OR(Z9=\"So\",Z9=\"Sa\"),\"WE\",IF(September!$M16=\"\",\"-\",September!$M16)),0)","v":"-"},1,{"$f":"Oktober!$A16","v":"Mi"},{"$f":"IF(AC9<>0,IF(OR(AC9=\"So\",AC9=\"Sa\"),\"WE\",IF(Oktober!$M16=\"\",\"-\",Oktober!$M16)),0)","v":"-"},1,{"$f":"November!$A16","v":"Sa"},{"$f":"IF(AF9<>0,IF(OR(AF9=\"So\",AF9=\"Sa\"),\"WE\",IF(November!$M16=\"\",\"-\",November!$M16)),0)","v":"WE"},0,{"$f":"Dezember!$A16","v":"Mo"},{"$f":"IF(AI9<>0,IF(OR(AI9=\"So\",AI9=\"Sa\"),\"WE\",IF(Dezember!$M16=\"\",\"-\",Dezember!$M16)),0)","v":"-"},1]
[null,{"$f":"Januar!A17","v":"Do"},{"$f":"IF(B10<>0,IF(OR(B10=\"So\",B10=\"Sa\"),\"WE\",IF(Januar!M17=\"\",\"-\",Januar!M17)),0)","v":"-"},1,{"$f":"Februar!A17","v":"So"},{"$f":"IF(E10<>0,IF(OR(E10=\"So\",E10=\"Sa\"),\"WE\",IF(Februar!M17=\"\",\"-\",Februar!M17)),0)","v":"WE"},0,{"$f":"März!$A17","v":"So"},{"$f":"IF(H10<>0,IF(OR(H10=\"So\",H10=\"Sa\"),\"WE\",IF(März!$M17=\"\",\"-\",März!$M17)),0)","v":"WE"},0,{"$f":"April!$A17","v":"Mi"},{"$f":"IF(K10<>0,IF(OR(K10=\"So\",K10=\"Sa\"),\"WE\",IF(April!$M17=\"\",\"-\",April!$M17)),0)","v":"-"},1,{"$f":"Mai!$A17","v":"Fr"},{"$f":"IF(N10<>0,IF(OR(N10=\"So\",N10=\"Sa\"),\"WE\",IF(Mai!$M17=\"\",\"-\",Mai!$M17)),0)","v":"-"},1,{"$f":"Juni!$A17","v":"Mo"},{"$f":"IF(Q10<>0,IF(OR(Q10=\"So\",Q10=\"Sa\"),\"WE\",IF(Juni!$M17=\"\",\"-\",Juni!$M17)),0)","v":"-"},1,{"$f":"Juli!$A17","v":"Mi"},{"$f":"IF(T10<>0,IF(OR(T10=\"So\",T10=\"Sa\"),\"WE\",IF(Juli!$M17=\"\",\"-\",Juli!$M17)),0)","v":"-"},1,{"$f":"August!$A17","v":"Sa"},{"$f":"IF(W10<>0,IF(OR(W10=\"So\",W10=\"Sa\"),\"WE\",IF(August!$M17=\"\",\"-\",August!$M17)),0)","v":"WE"},0,{"$f":"September!$A17","v":"Di"},{"$f":"IF(Z10<>0,IF(OR(Z10=\"So\",Z10=\"Sa\"),\"WE\",IF(September!$M17=\"\",\"-\",September!$M17)),0)","v":"-"},1,{"$f":"Oktober!$A17","v":"Do"},{"$f":"IF(AC10<>0,IF(OR(AC10=\"So\",AC10=\"Sa\"),\"WE\",IF(Oktober!$M17=\"\",\"-\",Oktober!$M17)),0)","v":"-"},1,{"$f":"November!$A17","v":"So"},{"$f":"IF(AF10<>0,IF(OR(AF10=\"So\",AF10=\"Sa\"),\"WE\",IF(November!$M17=\"\",\"-\",November!$M17)),0)","v":"WE"},0,{"$f":"Dezember!$A17","v":"Di"},{"$f":"IF(AI10<>0,IF(OR(AI10=\"So\",AI10=\"Sa\"),\"WE\",IF(Dezember!$M17=\"\",\"-\",Dezember!$M17)),0)","v":"-"},1]
[null,{"$f":"Januar!A18","v":"Fr"},{"$f":"IF(B11<>0,IF(OR(B11=\"So\",B11=\"Sa\"),\"WE\",IF(Januar!M18=\"\",\"-\",Januar!M18)),0)","v":"-"},1,{"$f":"Februar!A18","v":"Mo"},{"$f":"IF(E11<>0,IF(OR(E11=\"So\",E11=\"Sa\"),\"WE\",IF(Februar!M18=\"\",\"-\",Februar!M18)),0)","v":"-"},1,{"$f":"März!$A18","v":"Mo"},{"$f":"IF(H11<>0,IF(OR(H11=\"So\",H11=\"Sa\"),\"WE\",IF(März!$M18=\"\",\"-\",März!$M18)),0)","v":"-"},1,{"$f":"April!$A18","v":"Do"},{"$f":"IF(K11<>0,IF(OR(K11=\"So\",K11=\"Sa\"),\"WE\",IF(April!$M18=\"\",\"-\",April!$M18)),0)","v":"-"},1,{"$f":"Mai!$A18","v":"Sa"},{"$f":"IF(N11<>0,IF(OR(N11=\"So\",N11=\"Sa\"),\"WE\",IF(Mai!$M18=\"\",\"-\",Mai!$M18)),0)","v":"WE"},0,{"$f":"Juni!$A18","v":"Di"},{"$f":"IF(Q11<>0,IF(OR(Q11=\"So\",Q11=\"Sa\"),\"WE\",IF(Juni!$M18=\"\",\"-\",Juni!$M18)),0)","v":"-"},1,{"$f":"Juli!$A18","v":"Do"},{"$f":"IF(T11<>0,IF(OR(T11=\"So\",T11=\"Sa\"),\"WE\",IF(Juli!$M18=\"\",\"-\",Juli!$M18)),0)","v":"-"},1,{"$f":"August!$A18","v":"So"},{"$f":"IF(W11<>0,IF(OR(W11=\"So\",W11=\"Sa\"),\"WE\",IF(August!$M18=\"\",\"-\",August!$M18)),0)","v":"WE"},0,{"$f":"September!$A18","v":"Mi"},{"$f":"IF(Z11<>0,IF(OR(Z11=\"So\",Z11=\"Sa\"),\"WE\",IF(September!$M18=\"\",\"-\",September!$M18)),0)","v":"-"},1,{"$f":"Oktober!$A18","v":"Fr"},{"$f":"IF(AC11<>0,IF(OR(AC11=\"So\",AC11=\"Sa\"),\"WE\",IF(Oktober!$M18=\"\",\"-\",Oktober!$M18)),0)","v":"-"},1,{"$f":"November!$A18","v":"Mo"},{"$f":"IF(AF11<>0,IF(OR(AF11=\"So\",AF11=\"Sa\"),\"WE\",IF(November!$M18=\"\",\"-\",November!$M18)),0)","v":"-"},1,{"$f":"Dezember!$A18","v":"Mi"},{"$f":"IF(AI11<>0,IF(OR(AI11=\"So\",AI11=\"Sa\"),\"WE\",IF(Dezember!$M18=\"\",\"-\",Dezember!$M18)),0)","v":"-"},1]
[null,{"$f":"Januar!A19","v":"Sa"},{"$f":"IF(B12<>0,IF(OR(B12=\"So\",B12=\"Sa\"),\"WE\",IF(Januar!M19=\"\",\"-\",Januar!M19)),0)","v":"WE"},0,{"$f":"Februar!A19","v":"Di"},{"$f":"IF(E12<>0,IF(OR(E12=\"So\",E12=\"Sa\"),\"WE\",IF(Februar!M19=\"\",\"-\",Februar!M19)),0)","v":"-"},1,{"$f":"März!$A19","v":"Di"},{"$f":"IF(H12<>0,IF(OR(H12=\"So\",H12=\"Sa\"),\"WE\",IF(März!$M19=\"\",\"-\",März!$M19)),0)","v":"-"},1,{"$f":"April!$A19","v":"Fr"},{"$f":"IF(K12<>0,IF(OR(K12=\"So\",K12=\"Sa\"),\"WE\",IF(April!$M19=\"\",\"-\",April!$M19)),0)","v":"-"},1,{"$f":"Mai!$A19","v":"So"},{"$f":"IF(N12<>0,IF(OR(N12=\"So\",N12=\"Sa\"),\"WE\",IF(Mai!$M19=\"\",\"-\",Mai!$M19)),0)","v":"WE"},0,{"$f":"Juni!$A19","v":"Mi"},{"$f":"IF(Q12<>0,IF(OR(Q12=\"So\",Q12=\"Sa\"),\"WE\",IF(Juni!$M19=\"\",\"-\",Juni!$M19)),0)","v":"-"},1,{"$f":"Juli!$A19","v":"Fr"},{"$f":"IF(T12<>0,IF(OR(T12=\"So\",T12=\"Sa\"),\"WE\",IF(Juli!$M19=\"\",\"-\",Juli!$M19)),0)","v":"-"},1,{"$f":"August!$A19","v":"Mo"},{"$f":"IF(W12<>0,IF(OR(W12=\"So\",W12=\"Sa\"),\"WE\",IF(August!$M19=\"\",\"-\",August!$M19)),0)","v":"-"},1,{"$f":"September!$A19","v":"Do"},{"$f":"IF(Z12<>0,IF(OR(Z12=\"So\",Z12=\"Sa\"),\"WE\",IF(September!$M19=\"\",\"-\",September!$M19)),0)","v":"-"},1,{"$f":"Oktober!$A19","v":"Sa"},{"$f":"IF(AC12<>0,IF(OR(AC12=\"So\",AC12=\"Sa\"),\"WE\",IF(Oktober!$M19=\"\",\"-\",Oktober!$M19)),0)","v":"WE"},0,{"$f":"November!$A19","v":"Di"},{"$f":"IF(AF12<>0,IF(OR(AF12=\"So\",AF12=\"Sa\"),\"WE\",IF(November!$M19=\"\",\"-\",November!$M19)),0)","v":"-"},1,{"$f":"Dezember!$A19","v":"Do"},{"$f":"IF(AI12<>0,IF(OR(AI12=\"So\",AI12=\"Sa\"),\"WE\",IF(Dezember!$M19=\"\",\"-\",Dezember!$M19)),0)","v":"-"},1]
[null,{"$f":"Januar!A20","v":"So"},{"$f":"IF(B13<>0,IF(OR(B13=\"So\",B13=\"Sa\"),\"WE\",IF(Januar!M20=\"\",\"-\",Januar!M20)),0)","v":"WE"},0,{"$f":"Februar!A20","v":"Mi"},{"$f":"IF(E13<>0,IF(OR(E13=\"So\",E13=\"Sa\"),\"WE\",IF(Februar!M20=\"\",\"-\",Februar!M20)),0)","v":"-"},1,{"$f":"März!$A20","v":"Mi"},{"$f":"IF(H13<>0,IF(OR(H13=\"So\",H13=\"Sa\"),\"WE\",IF(März!$M20=\"\",\"-\",März!$M20)),0)","v":"-"},1,{"$f":"April!$A20","v":"Sa"},{"$f":"IF(K13<>0,IF(OR(K13=\"So\",K13=\"Sa\"),\"WE\",IF(April!$M20=\"\",\"-\",April!$M20)),0)","v":"WE"},0,{"$f":"Mai!$A20","v":"Mo"},{"$f":"IF(N13<>0,IF(OR(N13=\"So\",N13=\"Sa\"),\"WE\",IF(Mai!$M20=\"\",\"-\",Mai!$M20)),0)","v":"-"},1,{"$f":"Juni!$A20","v":"Do"},{"$f":"IF(Q13<>0,IF(OR(Q13=\"So\",Q13=\"Sa\"),\"WE\",IF(Juni!$M20=\"\",\"-\",Juni!$M20)),0)","v":"-"},1,{"$f":"Juli!$A20","v":"Sa"},{"$f":"IF(T13<>0,IF(OR(T13=\"So\",T13=\"Sa\"),\"WE\",IF(Juli!$M20=\"\",\"-\",Juli!$M20)),0)","v":"WE"},0,{"$f":"August!$A20","v":"Di"},{"$f":"IF(W13<>0,IF(OR(W13=\"So\",W13=\"Sa\"),\"WE\",IF(August!$M20=\"\",\"-\",August!$M20)),0)","v":"-"},1,{"$f":"September!$A20","v":"Fr"},{"$f":"IF(Z13<>0,IF(OR(Z13=\"So\",Z13=\"Sa\"),\"WE\",IF(September!$M20=\"\",\"-\",September!$M20)),0)","v":"-"},1,{"$f":"Oktober!$A20","v":"So"},{"$f":"IF(AC13<>0,IF(OR(AC13=\"So\",AC13=\"Sa\"),\"WE\",IF(Oktober!$M20=\"\",\"-\",Oktober!$M20)),0)","v":"WE"},0,{"$f":"November!$A20","v":"Mi"},{"$f":"IF(AF13<>0,IF(OR(AF13=\"So\",AF13=\"Sa\"),\"WE\",IF(November!$M20=\"\",\"-\",November!$M20)),0)","v":"-"},1,{"$f":"Dezember!$A20","v":"Fr"},{"$f":"IF(AI13<>0,IF(OR(AI13=\"So\",AI13=\"Sa\"),\"WE\",IF(Dezember!$M20=\"\",\"-\",Dezember!$M20)),0)","v":"-"},1]
[null,{"$f":"Januar!A21","v":"Mo"},{"$f":"IF(B14<>0,IF(OR(B14=\"So\",B14=\"Sa\"),\"WE\",IF(Januar!M21=\"\",\"-\",Januar!M21)),0)","v":"-"},1,{"$f":"Februar!A21","v":"Do"},{"$f":"IF(E14<>0,IF(OR(E14=\"So\",E14=\"Sa\"),\"WE\",IF(Februar!M21=\"\",\"-\",Februar!M21)),0)","v":"-"},1,{"$f":"März!$A21","v":"Do"},{"$f":"IF(H14<>0,IF(OR(H14=\"So\",H14=\"Sa\"),\"WE\",IF(März!$M21=\"\",\"-\",März!$M21)),0)","v":"-"},1,{"$f":"April!$A21","v":"So"},{"$f":"IF(K14<>0,IF(OR(K14=\"So\",K14=\"Sa\"),\"WE\",IF(April!$M21=\"\",\"-\",April!$M21)),0)","v":"WE"},0,{"$f":"Mai!$A21","v":"Di"},{"$f":"IF(N14<>0,IF(OR(N14=\"So\",N14=\"Sa\"),\"WE\",IF(Mai!$M21=\"\",\"-\",Mai!$M21)),0)","v":"-"},1,{"$f":"Juni!$A21","v":"Fr"},{"$f":"IF(Q14<>0,IF(OR(Q14=\"So\",Q14=\"Sa\"),\"WE\",IF(Juni!$M21=\"\",\"-\",Juni!$M21)),0)","v":"-"},1,{"$f":"Juli!$A21","v":"So"},{"$f":"IF(T14<>0,IF(OR(T14=\"So\",T14=\"Sa\"),\"WE\",IF(Juli!$M21=\"\",\"-\",Juli!$M21)),0)","v":"WE"},0,{"$f":"August!$A21","v":"Mi"},{"$f":"IF(W14<>0,IF(OR(W14=\"So\",W14=\"Sa\"),\"WE\",IF(August!$M21=\"\",\"-\",August!$M21)),0)","v":"-"},1,{"$f":"September!$A21","v":"Sa"},{"$f":"IF(Z14<>0,IF(OR(Z14=\"So\",Z14=\"Sa\"),\"WE\",IF(September!$M21=\"\",\"-\",September!$M21)),0)","v":"WE"},0,{"$f":"Oktober!$A21","v":"Mo"},{"$f":"IF(AC14<>0,IF(OR(AC14=\"So\",AC14=\"Sa\"),\"WE\",IF(Oktober!$M21=\"\",\"-\",Oktober!$M21)),0)","v":"-"},1,{"$f":"November!$A21","v":"Do"},{"$f":"IF(AF14<>0,IF(OR(AF14=\"So\",AF14=\"Sa\"),\"WE\",IF(November!$M21=\"\",\"-\",November!$M21)),0)","v":"-"},1,{"$f":"Dezember!$A21","v":"Sa"},{"$f":"IF(AI14<>0,IF(OR(AI14=\"So\",AI14=\"Sa\"),\"WE\",IF(Dezember!$M21=\"\",\"-\",Dezember!$M21)),0)","v":"WE"},0]
[null,{"$f":"Januar!A22","v":"Di"},{"$f":"IF(B15<>0,IF(OR(B15=\"So\",B15=\"Sa\"),\"WE\",IF(Januar!M22=\"\",\"-\",Januar!M22)),0)","v":"-"},1,{"$f":"Februar!A22","v":"Fr"},{"$f":"IF(E15<>0,IF(OR(E15=\"So\",E15=\"Sa\"),\"WE\",IF(Februar!M22=\"\",\"-\",Februar!M22)),0)","v":"-"},1,{"$f":"März!$A22","v":"Fr"},{"$f":"IF(H15<>0,IF(OR(H15=\"So\",H15=\"Sa\"),\"WE\",IF(März!$M22=\"\",\"-\",März!$M22)),0)","v":"-"},1,{"$f":"April!$A22","v":"Mo"},{"$f":"IF(K15<>0,IF(OR(K15=\"So\",K15=\"Sa\"),\"WE\",IF(April!$M22=\"\",\"-\",April!$M22)),0)","v":"-"},1,{"$f":"Mai!$A22","v":"Mi"},{"$f":"IF(N15<>0,IF(OR(N15=\"So\",N15=\"Sa\"),\"WE\",IF(Mai!$M22=\"\",\"-\",Mai!$M22)),0)","v":"-"},1,{"$f":"Juni!$A22","v":"Sa"},{"$f":"IF(Q15<>0,IF(OR(Q15=\"So\",Q15=\"Sa\"),\"WE\",IF(Juni!$M22=\"\",\"-\",Juni!$M22)),0)","v":"WE"},0,{"$f":"Juli!$A22","v":"Mo"},{"$f":"IF(T15<>0,IF(OR(T15=\"So\",T15=\"Sa\"),\"WE\",IF(Juli!$M22=\"\",\"-\",Juli!$M22)),0)","v":"-"},1,{"$f":"August!$A22","v":"Do"},{"$f":"IF(W15<>0,IF(OR(W15=\"So\",W15=\"Sa\"),\"WE\",IF(August!$M22=\"\",\"-\",August!$M22)),0)","v":"-"},1,{"$f":"September!$A22","v":"So"},{"$f":"IF(Z15<>0,IF(OR(Z15=\"So\",Z15=\"Sa\"),\"WE\",IF(September!$M22=\"\",\"-\",September!$M22)),0)","v":"WE"},0,{"$f":"Oktober!$A22","v":"Di"},{"$f":"IF(AC15<>0,IF(OR(AC15=\"So\",AC15=\"Sa\"),\"WE\",IF(Oktober!$M22=\"\",\"-\",Oktober!$M22)),0)","v":"-"},1,{"$f":"November!$A22","v":"Fr"},{"$f":"IF(AF15<>0,IF(OR(AF15=\"So\",AF15=\"Sa\"),\"WE\",IF(November!$M22=\"\",\"-\",November!$M22)),0)","v":"-"},1,{"$f":"Dezember!$A22","v":"So"},{"$f":"IF(AI15<>0,IF(OR(AI15=\"So\",AI15=\"Sa\"),\"WE\",IF(Dezember!$M22=\"\",\"-\",Dezember!$M22)),0)","v":"WE"},0]
[null,{"$f":"Januar!A23","v":"Mi"},{"$f":"IF(B16<>0,IF(OR(B16=\"So\",B16=\"Sa\"),\"WE\",IF(Januar!M23=\"\",\"-\",Januar!M23)),0)","v":"-"},1,{"$f":"Februar!A23","v":"Sa"},{"$f":"IF(E16<>0,IF(OR(E16=\"So\",E16=\"Sa\"),\"WE\",IF(Februar!M23=\"\",\"-\",Februar!M23)),0)","v":"WE"},0,{"$f":"März!$A23","v":"Sa"},{"$f":"IF(H16<>0,IF(OR(H16=\"So\",H16=\"Sa\"),\"WE\",IF(März!$M23=\"\",\"-\",März!$M23)),0)","v":"WE"},0,{"$f":"April!$A23","v":"Di"},{"$f":"IF(K16<>0,IF(OR(K16=\"So\",K16=\"Sa\"),\"WE\",IF(April!$M23=\"\",\"-\",April!$M23)),0)","v":"-"},1,{"$f":"Mai!$A23","v":"Do"},{"$f":"IF(N16<>0,IF(OR(N16=\"So\",N16=\"Sa\"),\"WE\",IF(Mai!$M23=\"\",\"-\",Mai!$M23)),0)","v":"FT"},0,{"$f":"Juni!$A23","v":"So"},{"$f":"IF(Q16<>0,IF(OR(Q16=\"So\",Q16=\"Sa\"),\"WE\",IF(Juni!$M23=\"\",\"-\",Juni!$M23)),0)","v":"WE"},0,{"$f":"Juli!$A23","v":"Di"},{"$f":"IF(T16<>0,IF(OR(T16=\"So\",T16=\"Sa\"),\"WE\",IF(Juli!$M23=\"\",\"-\",Juli!$M23)),0)","v":"-"},1,{"$f":"August!$A23","v":"Fr"},{"$f":"IF(W16<>0,IF(OR(W16=\"So\",W16=\"Sa\"),\"WE\",IF(August!$M23=\"\",\"-\",August!$M23)),0)","v":"-"},1,{"$f":"September!$A23","v":"Mo"},{"$f":"IF(Z16<>0,IF(OR(Z16=\"So\",Z16=\"Sa\"),\"WE\",IF(September!$M23=\"\",\"-\",September!$M23)),0)","v":"-"},1,{"$f":"Oktober!$A23","v":"Mi"},{"$f":"IF(AC16<>0,IF(OR(AC16=\"So\",AC16=\"Sa\"),\"WE\",IF(Oktober!$M23=\"\",\"-\",Oktober!$M23)),0)","v":"-"},1,{"$f":"November!$A23","v":"Sa"},{"$f":"IF(AF16<>0,IF(OR(AF16=\"So\",AF16=\"Sa\"),\"WE\",IF(November!$M23=\"\",\"-\",November!$M23)),0)","v":"WE"},0,{"$f":"Dezember!$A23","v":"Mo"},{"$f":"IF(AI16<>0,IF(OR(AI16=\"So\",AI16=\"Sa\"),\"WE\",IF(Dezember!$M23=\"\",\"-\",Dezember!$M23)),0)","v":"-"},1]
[null,{"$f":"Januar!A24","v":"Do"},{"$f":"IF(B17<>0,IF(OR(B17=\"So\",B17=\"Sa\"),\"WE\",IF(Januar!M24=\"\",\"-\",Januar!M24)),0)","v":"-"},1,{"$f":"Februar!A24","v":"So"},{"$f":"IF(E17<>0,IF(OR(E17=\"So\",E17=\"Sa\"),\"WE\",IF(Februar!M24=\"\",\"-\",Februar!M24)),0)","v":"WE"},0,{"$f":"März!$A24","v":"So"},{"$f":"IF(H17<>0,IF(OR(H17=\"So\",H17=\"Sa\"),\"WE\",IF(März!$M24=\"\",\"-\",März!$M24)),0)","v":"WE"},0,{"$f":"April!$A24","v":"Mi"},{"$f":"IF(K17<>0,IF(OR(K17=\"So\",K17=\"Sa\"),\"WE\",IF(April!$M24=\"\",\"-\",April!$M24)),0)","v":"-"},1,{"$f":"Mai!$A24","v":"Fr"},{"$f":"IF(N17<>0,IF(OR(N17=\"So\",N17=\"Sa\"),\"WE\",IF(Mai!$M24=\"\",\"-\",Mai!$M24)),0)","v":"-"},1,{"$f":"Juni!$A24","v":"Mo"},{"$f":"IF(Q17<>0,IF(OR(Q17=\"So\",Q17=\"Sa\"),\"WE\",IF(Juni!$M24=\"\",\"-\",Juni!$M24)),0)","v":"-"},1,{"$f":"Juli!$A24","v":"Mi"},{"$f":"IF(T17<>0,IF(OR(T17=\"So\",T17=\"Sa\"),\"WE\",IF(Juli!$M24=\"\",\"-\",Juli!$M24)),0)","v":"-"},1,{"$f":"August!$A24","v":"Sa"},{"$f":"IF(W17<>0,IF(OR(W17=\"So\",W17=\"Sa\"),\"WE\",IF(August!$M24=\"\",\"-\",August!$M24)),0)","v":"WE"},0,{"$f":"September!$A24","v":"Di"},{"$f":"IF(Z17<>0,IF(OR(Z17=\"So\",Z17=\"Sa\"),\"WE\",IF(September!$M24=\"\",\"-\",September!$M24)),0)","v":"-"},1,{"$f":"Oktober!$A24","v":"Do"},{"$f":"IF(AC17<>0,IF(OR(AC17=\"So\",AC17=\"Sa\"),\"WE\",IF(Oktober!$M24=\"\",\"-\",Oktober!$M24)),0)","v":"-"},1,{"$f":"November!$A24","v":"So"},{"$f":"IF(AF17<>0,IF(OR(AF17=\"So\",AF17=\"Sa\"),\"WE\",IF(November!$M24=\"\",\"-\",November!$M24)),0)","v":"WE"},0,{"$f":"Dezember!$A24","v":"Di"},{"$f":"IF(AI17<>0,IF(OR(AI17=\"So\",AI17=\"Sa\"),\"WE\",IF(Dezember!$M24=\"\",\"-\",Dezember!$M24)),0)","v":"-"},1]
[null,{"$f":"Januar!A25","v":"Fr"},{"$f":"IF(B18<>0,IF(OR(B18=\"So\",B18=\"Sa\"),\"WE\",IF(Januar!M25=\"\",\"-\",Januar!M25)),0)","v":"-"},1,{"$f":"Februar!A25","v":"Mo"},{"$f":"IF(E18<>0,IF(OR(E18=\"So\",E18=\"Sa\"),\"WE\",IF(Februar!M25=\"\",\"-\",Februar!M25)),0)","v":"-"},1,{"$f":"März!$A25","v":"Mo"},{"$f":"IF(H18<>0,IF(OR(H18=\"So\",H18=\"Sa\"),\"WE\",IF(März!$M25=\"\",\"-\",März!$M25)),0)","v":"-"},1,{"$f":"April!$A25","v":"Do"},{"$f":"IF(K18<>0,IF(OR(K18=\"So\",K18=\"Sa\"),\"WE\",IF(April!$M25=\"\",\"-\",April!$M25)),0)","v":"-"},1,{"$f":"Mai!$A25","v":"Sa"},{"$f":"IF(N18<>0,IF(OR(N18=\"So\",N18=\"Sa\"),\"WE\",IF(Mai!$M25=\"\",\"-\",Mai!$M25)),0)","v":"WE"},0,{"$f":"Juni!$A25","v":"Di"},{"$f":"IF(Q18<>0,IF(OR(Q18=\"So\",Q18=\"Sa\"),\"WE\",IF(Juni!$M25=\"\",\"-\",Juni!$M25)),0)","v":"-"},1,{"$f":"Juli!$A25","v":"Do"},{"$f":"IF(T18<>0,IF(OR(T18=\"So\",T18=\"Sa\"),\"WE\",IF(Juli!$M25=\"\",\"-\",Juli!$M25)),0)","v":"-"},1,{"$f":"August!$A25","v":"So"},{"$f":"IF(W18<>0,IF(OR(W18=\"So\",W18=\"Sa\"),\"WE\",IF(August!$M25=\"\",\"-\",August!$M25)),0)","v":"WE"},0,{"$f":"September!$A25","v":"Mi"},{"$f":"IF(Z18<>0,IF(OR(Z18=\"So\",Z18=\"Sa\"),\"WE\",IF(September!$M25=\"\",\"-\",September!$M25)),0)","v":"-"},1,{"$f":"Oktober!$A25","v":"Fr"},{"$f":"IF(AC18<>0,IF(OR(AC18=\"So\",AC18=\"Sa\"),\"WE\",IF(Oktober!$M25=\"\",\"-\",Oktober!$M25)),0)","v":"-"},1,{"$f":"November!$A25","v":"Mo"},{"$f":"IF(AF18<>0,IF(OR(AF18=\"So\",AF18=\"Sa\"),\"WE\",IF(November!$M25=\"\",\"-\",November!$M25)),0)","v":"-"},1,{"$f":"Dezember!$A25","v":"Mi"},{"$f":"IF(AI18<>0,IF(OR(AI18=\"So\",AI18=\"Sa\"),\"WE\",IF(Dezember!$M25=\"\",\"-\",Dezember!$M25)),0)","v":"-"},1]
[null,{"$f":"Januar!A26","v":"Sa"},{"$f":"IF(B19<>0,IF(OR(B19=\"So\",B19=\"Sa\"),\"WE\",IF(Januar!M26=\"\",\"-\",Januar!M26)),0)","v":"WE"},0,{"$f":"Februar!A26","v":"Di"},{"$f":"IF(E19<>0,IF(OR(E19=\"So\",E19=\"Sa\"),\"WE\",IF(Februar!M26=\"\",\"-\",Februar!M26)),0)","v":"-"},1,{"$f":"März!$A26","v":"Di"},{"$f":"IF(H19<>0,IF(OR(H19=\"So\",H19=\"Sa\"),\"WE\",IF(März!$M26=\"\",\"-\",März!$M26)),0)","v":"-"},1,{"$f":"April!$A26","v":"Fr"},{"$f":"IF(K19<>0,IF(OR(K19=\"So\",K19=\"Sa\"),\"WE\",IF(April!$M26=\"\",\"-\",April!$M26)),0)","v":"-"},1,{"$f":"Mai!$A26","v":"So"},{"$f":"IF(N19<>0,IF(OR(N19=\"So\",N19=\"Sa\"),\"WE\",IF(Mai!$M26=\"\",\"-\",Mai!$M26)),0)","v":"WE"},0,{"$f":"Juni!$A26","v":"Mi"},{"$f":"IF(Q19<>0,IF(OR(Q19=\"So\",Q19=\"Sa\"),\"WE\",IF(Juni!$M26=\"\",\"-\",Juni!$M26)),0)","v":"-"},1,{"$f":"Juli!$A26","v":"Fr"},{"$f":"IF(T19<>0,IF(OR(T19=\"So\",T19=\"Sa\"),\"WE\",IF(Juli!$M26=\"\",\"-\",Juli!$M26)),0)","v":"-"},1,{"$f":"August!$A26","v":"Mo"},{"$f":"IF(W19<>0,IF(OR(W19=\"So\",W19=\"Sa\"),\"WE\",IF(August!$M26=\"\",\"-\",August!$M26)),0)","v":"-"},1,{"$f":"September!$A26","v":"Do"},{"$f":"IF(Z19<>0,IF(OR(Z19=\"So\",Z19=\"Sa\"),\"WE\",IF(September!$M26=\"\",\"-\",September!$M26)),0)","v":"-"},1,{"$f":"Oktober!$A26","v":"Sa"},{"$f":"IF(AC19<>0,IF(OR(AC19=\"So\",AC19=\"Sa\"),\"WE\",IF(Oktober!$M26=\"\",\"-\",Oktober!$M26)),0)","v":"WE"},0,{"$f":"November!$A26","v":"Di"},{"$f":"IF(AF19<>0,IF(OR(AF19=\"So\",AF19=\"Sa\"),\"WE\",IF(November!$M26=\"\",\"-\",November!$M26)),0)","v":"-"},1,{"$f":"Dezember!$A26","v":"Do"},{"$f":"IF(AI19<>0,IF(OR(AI19=\"So\",AI19=\"Sa\"),\"WE\",IF(Dezember!$M26=\"\",\"-\",Dezember!$M26)),0)","v":"-"},1]
[null,{"$f":"Januar!A27","v":"So"},{"$f":"IF(B20<>0,IF(OR(B20=\"So\",B20=\"Sa\"),\"WE\",IF(Januar!M27=\"\",\"-\",Januar!M27)),0)","v":"WE"},0,{"$f":"Februar!A27","v":"Mi"},{"$f":"IF(E20<>0,IF(OR(E20=\"So\",E20=\"Sa\"),\"WE\",IF(Februar!M27=\"\",\"-\",Februar!M27)),0)","v":"-"},1,{"$f":"März!$A27","v":"Mi"},{"$f":"IF(H20<>0,IF(OR(H20=\"So\",H20=\"Sa\"),\"WE\",IF(März!$M27=\"\",\"-\",März!$M27)),0)","v":"-"},1,{"$f":"April!$A27","v":"Sa"},{"$f":"IF(K20<>0,IF(OR(K20=\"So\",K20=\"Sa\"),\"WE\",IF(April!$M27=\"\",\"-\",April!$M27)),0)","v":"WE"},0,{"$f":"Mai!$A27","v":"Mo"},{"$f":"IF(N20<>0,IF(OR(N20=\"So\",N20=\"Sa\"),\"WE\",IF(Mai!$M27=\"\",\"-\",Mai!$M27)),0)","v":"-"},1,{"$f":"Juni!$A27","v":"Do"},{"$f":"IF(Q20<>0,IF(OR(Q20=\"So\",Q20=\"Sa\"),\"WE\",IF(Juni!$M27=\"\",\"-\",Juni!$M27)),0)","v":"-"},1,{"$f":"Juli!$A27","v":"Sa"},{"$f":"IF(T20<>0,IF(OR(T20=\"So\",T20=\"Sa\"),\"WE\",IF(Juli!$M27=\"\",\"-\",Juli!$M27)),0)","v":"WE"},0,{"$f":"August!$A27","v":"Di"},{"$f":"IF(W20<>0,IF(OR(W20=\"So\",W20=\"Sa\"),\"WE\",IF(August!$M27=\"\",\"-\",August!$M27)),0)","v":"-"},1,{"$f":"September!$A27","v":"Fr"},{"$f":"IF(Z20<>0,IF(OR(Z20=\"So\",Z20=\"Sa\"),\"WE\",IF(September!$M27=\"\",\"-\",September!$M27)),0)","v":"-"},1,{"$f":"Oktober!$A27","v":"So"},{"$f":"IF(AC20<>0,IF(OR(AC20=\"So\",AC20=\"Sa\"),\"WE\",IF(Oktober!$M27=\"\",\"-\",Oktober!$M27)),0)","v":"WE"},0,{"$f":"November!$A27","v":"Mi"},{"$f":"IF(AF20<>0,IF(OR(AF20=\"So\",AF20=\"Sa\"),\"WE\",IF(November!$M27=\"\",\"-\",November!$M27)),0)","v":"-"},1,{"$f":"Dezember!$A27","v":"Fr"},{"$f":"IF(AI20<>0,IF(OR(AI20=\"So\",AI20=\"Sa\"),\"WE\",IF(Dezember!$M27=\"\",\"-\",Dezember!$M27)),0)","v":"-"},1]
[null,{"$f":"Januar!A28","v":"Mo"},{"$f":"IF(B21<>0,IF(OR(B21=\"So\",B21=\"Sa\"),\"WE\",IF(Januar!M28=\"\",\"-\",Januar!M28)),0)","v":"-"},1,{"$f":"Februar!A28","v":"Do"},{"$f":"IF(E21<>0,IF(OR(E21=\"So\",E21=\"Sa\"),\"WE\",IF(Februar!M28=\"\",\"-\",Februar!M28)),0)","v":"-"},1,{"$f":"März!$A28","v":"Do"},{"$f":"IF(H21<>0,IF(OR(H21=\"So\",H21=\"Sa\"),\"WE\",IF(März!$M28=\"\",\"-\",März!$M28)),0)","v":"-"},1,{"$f":"April!$A28","v":"So"},{"$f":"IF(K21<>0,IF(OR(K21=\"So\",K21=\"Sa\"),\"WE\",IF(April!$M28=\"\",\"-\",April!$M28)),0)","v":"WE"},0,{"$f":"Mai!$A28","v":"Di"},{"$f":"IF(N21<>0,IF(OR(N21=\"So\",N21=\"Sa\"),\"WE\",IF(Mai!$M28=\"\",\"-\",Mai!$M28)),0)","v":"-"},1,{"$f":"Juni!$A28","v":"Fr"},{"$f":"IF(Q21<>0,IF(OR(Q21=\"So\",Q21=\"Sa\"),\"WE\",IF(Juni!$M28=\"\",\"-\",Juni!$M28)),0)","v":"-"},1,{"$f":"Juli!$A28","v":"So"},{"$f":"IF(T21<>0,IF(OR(T21=\"So\",T21=\"Sa\"),\"WE\",IF(Juli!$M28=\"\",\"-\",Juli!$M28)),0)","v":"WE"},0,{"$f":"August!$A28","v":"Mi"},{"$f":"IF(W21<>0,IF(OR(W21=\"So\",W21=\"Sa\"),\"WE\",IF(August!$M28=\"\",\"-\",August!$M28)),0)","v":"-"},1,{"$f":"September!$A28","v":"Sa"},{"$f":"IF(Z21<>0,IF(OR(Z21=\"So\",Z21=\"Sa\"),\"WE\",IF(September!$M28=\"\",\"-\",September!$M28)),0)","v":"WE"},0,{"$f":"Oktober!$A28","v":"Mo"},{"$f":"IF(AC21<>0,IF(OR(AC21=\"So\",AC21=\"Sa\"),\"WE\",IF(Oktober!$M28=\"\",\"-\",Oktober!$M28)),0)","v":"-"},1,{"$f":"November!$A28","v":"Do"},{"$f":"IF(AF21<>0,IF(OR(AF21=\"So\",AF21=\"Sa\"),\"WE\",IF(November!$M28=\"\",\"-\",November!$M28)),0)","v":"-"},1,{"$f":"Dezember!$A28","v":"Sa"},{"$f":"IF(AI21<>0,IF(OR(AI21=\"So\",AI21=\"Sa\"),\"WE\",IF(Dezember!$M28=\"\",\"-\",Dezember!$M28)),0)","v":"WE"},0]
[null,{"$f":"Januar!A29","v":"Di"},{"$f":"IF(B22<>0,IF(OR(B22=\"So\",B22=\"Sa\"),\"WE\",IF(Januar!M29=\"\",\"-\",Januar!M29)),0)","v":"-"},1,{"$f":"Februar!A29","v":"Fr"},{"$f":"IF(E22<>0,IF(OR(E22=\"So\",E22=\"Sa\"),\"WE\",IF(Februar!M29=\"\",\"-\",Februar!M29)),0)","v":"-"},1,{"$f":"März!$A29","v":"Fr"},{"$f":"IF(H22<>0,IF(OR(H22=\"So\",H22=\"Sa\"),\"WE\",IF(März!$M29=\"\",\"-\",März!$M29)),0)","v":"-"},1,{"$f":"April!$A29","v":"Mo"},{"$f":"IF(K22<>0,IF(OR(K22=\"So\",K22=\"Sa\"),\"WE\",IF(April!$M29=\"\",\"-\",April!$M29)),0)","v":"-"},1,{"$f":"Mai!$A29","v":"Mi"},{"$f":"IF(N22<>0,IF(OR(N22=\"So\",N22=\"Sa\"),\"WE\",IF(Mai!$M29=\"\",\"-\",Mai!$M29)),0)","v":"-"},1,{"$f":"Juni!$A29","v":"Sa"},{"$f":"IF(Q22<>0,IF(OR(Q22=\"So\",Q22=\"Sa\"),\"WE\",IF(Juni!$M29=\"\",\"-\",Juni!$M29)),0)","v":"WE"},0,{"$f":"Juli!$A29","v":"Mo"},{"$f":"IF(T22<>0,IF(OR(T22=\"So\",T22=\"Sa\"),\"WE\",IF(Juli!$M29=\"\",\"-\",Juli!$M29)),0)","v":"-"},1,{"$f":"August!$A29","v":"Do"},{"$f":"IF(W22<>0,IF(OR(W22=\"So\",W22=\"Sa\"),\"WE\",IF(August!$M29=\"\",\"-\",August!$M29)),0)","v":"-"},1,{"$f":"September!$A29","v":"So"},{"$f":"IF(Z22<>0,IF(OR(Z22=\"So\",Z22=\"Sa\"),\"WE\",IF(September!$M29=\"\",\"-\",September!$M29)),0)","v":"WE"},0,{"$f":"Oktober!$A29","v":"Di"},{"$f":"IF(AC22<>0,IF(OR(AC22=\"So\",AC22=\"Sa\"),\"WE\",IF(Oktober!$M29=\"\",\"-\",Oktober!$M29)),0)","v":"-"},1,{"$f":"November!$A29","v":"Fr"},{"$f":"IF(AF22<>0,IF(OR(AF22=\"So\",AF22=\"Sa\"),\"WE\",IF(November!$M29=\"\",\"-\",November!$M29)),0)","v":"-"},1,{"$f":"Dezember!$A29","v":"So"},{"$f":"IF(AI22<>0,IF(OR(AI22=\"So\",AI22=\"Sa\"),\"WE\",IF(Dezember!$M29=\"\",\"-\",Dezember!$M29)),0)","v":"WE"},0]
[null,{"$f":"Januar!A30","v":"Mi"},{"$f":"IF(B23<>0,IF(OR(B23=\"So\",B23=\"Sa\"),\"WE\",IF(Januar!M30=\"\",\"-\",Januar!M30)),0)","v":"-"},1,{"$f":"Februar!A30","v":"Sa"},{"$f":"IF(E23<>0,IF(OR(E23=\"So\",E23=\"Sa\"),\"WE\",IF(Februar!M30=\"\",\"-\",Februar!M30)),0)","v":"WE"},0,{"$f":"März!$A30","v":"Sa"},{"$f":"IF(H23<>0,IF(OR(H23=\"So\",H23=\"Sa\"),\"WE\",IF(März!$M30=\"\",\"-\",März!$M30)),0)","v":"WE"},0,{"$f":"April!$A30","v":"Di"},{"$f":"IF(K23<>0,IF(OR(K23=\"So\",K23=\"Sa\"),\"WE\",IF(April!$M30=\"\",\"-\",April!$M30)),0)","v":"-"},1,{"$f":"Mai!$A30","v":"Do"},{"$f":"IF(N23<>0,IF(OR(N23=\"So\",N23=\"Sa\"),\"WE\",IF(Mai!$M30=\"\",\"-\",Mai!$M30)),0)","v":"-"},1,{"$f":"Juni!$A30","v":"So"},{"$f":"IF(Q23<>0,IF(OR(Q23=\"So\",Q23=\"Sa\"),\"WE\",IF(Juni!$M30=\"\",\"-\",Juni!$M30)),0)","v":"WE"},0,{"$f":"Juli!$A30","v":"Di"},{"$f":"IF(T23<>0,IF(OR(T23=\"So\",T23=\"Sa\"),\"WE\",IF(Juli!$M30=\"\",\"-\",Juli!$M30)),0)","v":"-"},1,{"$f":"August!$A30","v":"Fr"},{"$f":"IF(W23<>0,IF(OR(W23=\"So\",W23=\"Sa\"),\"WE\",IF(August!$M30=\"\",\"-\",August!$M30)),0)","v":"-"},1,{"$f":"September!$A30","v":"Mo"},{"$f":"IF(Z23<>0,IF(OR(Z23=\"So\",Z23=\"Sa\"),\"WE\",IF(September!$M30=\"\",\"-\",September!$M30)),0)","v":"-"},1,{"$f":"Oktober!$A30","v":"Mi"},{"$f":"IF(AC23<>0,IF(OR(AC23=\"So\",AC23=\"Sa\"),\"WE\",IF(Oktober!$M30=\"\",\"-\",Oktober!$M30)),0)","v":"-"},1,{"$f":"November!$A30","v":"Sa"},{"$f":"IF(AF23<>0,IF(OR(AF23=\"So\",AF23=\"Sa\"),\"WE\",IF(November!$M30=\"\",\"-\",November!$M30)),0)","v":"WE"},0,{"$f":"Dezember!$A30","v":"Mo"},{"$f":"IF(AI23<>0,IF(OR(AI23=\"So\",AI23=\"Sa\"),\"WE\",IF(Dezember!$M30=\"\",\"-\",Dezember!$M30)),0)","v":"-"},1]
[null,{"$f":"Januar!A31","v":"Do"},{"$f":"IF(B24<>0,IF(OR(B24=\"So\",B24=\"Sa\"),\"WE\",IF(Januar!M31=\"\",\"-\",Januar!M31)),0)","v":"-"},1,{"$f":"Februar!A31","v":"So"},{"$f":"IF(E24<>0,IF(OR(E24=\"So\",E24=\"Sa\"),\"WE\",IF(Februar!M31=\"\",\"-\",Februar!M31)),0)","v":"WE"},0,{"$f":"März!$A31","v":"So"},{"$f":"IF(H24<>0,IF(OR(H24=\"So\",H24=\"Sa\"),\"WE\",IF(März!$M31=\"\",\"-\",März!$M31)),0)","v":"WE"},0,{"$f":"April!$A31","v":"Mi"},{"$f":"IF(K24<>0,IF(OR(K24=\"So\",K24=\"Sa\"),\"WE\",IF(April!$M31=\"\",\"-\",April!$M31)),0)","v":"-"},1,{"$f":"Mai!$A31","v":"Fr"},{"$f":"IF(N24<>0,IF(OR(N24=\"So\",N24=\"Sa\"),\"WE\",IF(Mai!$M31=\"\",\"-\",Mai!$M31)),0)","v":"-"},1,{"$f":"Juni!$A31","v":"Mo"},{"$f":"IF(Q24<>0,IF(OR(Q24=\"So\",Q24=\"Sa\"),\"WE\",IF(Juni!$M31=\"\",\"-\",Juni!$M31)),0)","v":"-"},1,{"$f":"Juli!$A31","v":"Mi"},{"$f":"IF(T24<>0,IF(OR(T24=\"So\",T24=\"Sa\"),\"WE\",IF(Juli!$M31=\"\",\"-\",Juli!$M31)),0)","v":"-"},1,{"$f":"August!$A31","v":"Sa"},{"$f":"IF(W24<>0,IF(OR(W24=\"So\",W24=\"Sa\"),\"WE\",IF(August!$M31=\"\",\"-\",August!$M31)),0)","v":"WE"},0,{"$f":"September!$A31","v":"Di"},{"$f":"IF(Z24<>0,IF(OR(Z24=\"So\",Z24=\"Sa\"),\"WE\",IF(September!$M31=\"\",\"-\",September!$M31)),0)","v":"-"},1,{"$f":"Oktober!$A31","v":"Do"},{"$f":"IF(AC24<>0,IF(OR(AC24=\"So\",AC24=\"Sa\"),\"WE\",IF(Oktober!$M31=\"\",\"-\",Oktober!$M31)),0)","v":"-"},1,{"$f":"November!$A31","v":"So"},{"$f":"IF(AF24<>0,IF(OR(AF24=\"So\",AF24=\"Sa\"),\"WE\",IF(November!$M31=\"\",\"-\",November!$M31)),0)","v":"WE"},0,{"$f":"Dezember!$A31","v":"Di"},{"$f":"IF(AI24<>0,IF(OR(AI24=\"So\",AI24=\"Sa\"),\"WE\",IF(Dezember!$M31=\"\",\"-\",Dezember!$M31)),0)","v":"-"},1]
[null,{"$f":"Januar!A32","v":"Fr"},{"$f":"IF(B25<>0,IF(OR(B25=\"So\",B25=\"Sa\"),\"WE\",IF(Januar!M32=\"\",\"-\",Januar!M32)),0)","v":"-"},1,{"$f":"Februar!A32","v":"Mo"},{"$f":"IF(E25<>0,IF(OR(E25=\"So\",E25=\"Sa\"),\"WE\",IF(Februar!M32=\"\",\"-\",Februar!M32)),0)","v":"-"},1,{"$f":"März!$A32","v":"Mo"},{"$f":"IF(H25<>0,IF(OR(H25=\"So\",H25=\"Sa\"),\"WE\",IF(März!$M32=\"\",\"-\",März!$M32)),0)","v":"-"},1,{"$f":"April!$A32","v":"Do"},{"$f":"IF(K25<>0,IF(OR(K25=\"So\",K25=\"Sa\"),\"WE\",IF(April!$M32=\"\",\"-\",April!$M32)),0)","v":"-"},1,{"$f":"Mai!$A32","v":"Sa"},{"$f":"IF(N25<>0,IF(OR(N25=\"So\",N25=\"Sa\"),\"WE\",IF(Mai!$M32=\"\",\"-\",Mai!$M32)),0)","v":"WE"},0,{"$f":"Juni!$A32","v":"Di"},{"$f":"IF(Q25<>0,IF(OR(Q25=\"So\",Q25=\"Sa\"),\"WE\",IF(Juni!$M32=\"\",\"-\",Juni!$M32)),0)","v":"-"},1,{"$f":"Juli!$A32","v":"Do"},{"$f":"IF(T25<>0,IF(OR(T25=\"So\",T25=\"Sa\"),\"WE\",IF(Juli!$M32=\"\",\"-\",Juli!$M32)),0)","v":"-"},1,{"$f":"August!$A32","v":"So"},{"$f":"IF(W25<>0,IF(OR(W25=\"So\",W25=\"Sa\"),\"WE\",IF(August!$M32=\"\",\"-\",August!$M32)),0)","v":"WE"},0,{"$f":"September!$A32","v":"Mi"},{"$f":"IF(Z25<>0,IF(OR(Z25=\"So\",Z25=\"Sa\"),\"WE\",IF(September!$M32=\"\",\"-\",September!$M32)),0)","v":"-"},1,{"$f":"Oktober!$A32","v":"Fr"},{"$f":"IF(AC25<>0,IF(OR(AC25=\"So\",AC25=\"Sa\"),\"WE\",IF(Oktober!$M32=\"\",\"-\",Oktober!$M32)),0)","v":"-"},1,{"$f":"November!$A32","v":"Mo"},{"$f":"IF(AF25<>0,IF(OR(AF25=\"So\",AF25=\"Sa\"),\"WE\",IF(November!$M32=\"\",\"-\",November!$M32)),0)","v":"-"},1,{"$f":"Dezember!$A32","v":"Mi"},{"$f":"IF(AI25<>0,IF(OR(AI25=\"So\",AI25=\"Sa\"),\"WE\",IF(Dezember!$M32=\"\",\"-\",Dezember!$M32)),0)","v":"-"},1]
[null,{"$f":"Januar!A33","v":"Sa"},{"$f":"IF(B26<>0,IF(OR(B26=\"So\",B26=\"Sa\"),\"WE\",IF(Januar!M33=\"\",\"-\",Januar!M33)),0)","v":"WE"},0,{"$f":"Februar!A33","v":"Di"},{"$f":"IF(E26<>0,IF(OR(E26=\"So\",E26=\"Sa\"),\"WE\",IF(Februar!M33=\"\",\"-\",Februar!M33)),0)","v":"-"},1,{"$f":"März!$A33","v":"Di"},{"$f":"IF(H26<>0,IF(OR(H26=\"So\",H26=\"Sa\"),\"WE\",IF(März!$M33=\"\",\"-\",März!$M33)),0)","v":"-"},1,{"$f":"April!$A33","v":"Fr"},{"$f":"IF(K26<>0,IF(OR(K26=\"So\",K26=\"Sa\"),\"WE\",IF(April!$M33=\"\",\"-\",April!$M33)),0)","v":"-"},1,{"$f":"Mai!$A33","v":"So"},{"$f":"IF(N26<>0,IF(OR(N26=\"So\",N26=\"Sa\"),\"WE\",IF(Mai!$M33=\"\",\"-\",Mai!$M33)),0)","v":"WE"},0,{"$f":"Juni!$A33","v":"Mi"},{"$f":"IF(Q26<>0,IF(OR(Q26=\"So\",Q26=\"Sa\"),\"WE\",IF(Juni!$M33=\"\",\"-\",Juni!$M33)),0)","v":"-"},1,{"$f":"Juli!$A33","v":"Fr"},{"$f":"IF(T26<>0,IF(OR(T26=\"So\",T26=\"Sa\"),\"WE\",IF(Juli!$M33=\"\",\"-\",Juli!$M33)),0)","v":"-"},1,{"$f":"August!$A33","v":"Mo"},{"$f":"IF(W26<>0,IF(OR(W26=\"So\",W26=\"Sa\"),\"WE\",IF(August!$M33=\"\",\"-\",August!$M33)),0)","v":"-"},1,{"$f":"September!$A33","v":"Do"},{"$f":"IF(Z26<>0,IF(OR(Z26=\"So\",Z26=\"Sa\"),\"WE\",IF(September!$M33=\"\",\"-\",September!$M33)),0)","v":"-"},1,{"$f":"Oktober!$A33","v":"Sa"},{"$f":"IF(AC26<>0,IF(OR(AC26=\"So\",AC26=\"Sa\"),\"WE\",IF(Oktober!$M33=\"\",\"-\",Oktober!$M33)),0)","v":"WE"},0,{"$f":"November!$A33","v":"Di"},{"$f":"IF(AF26<>0,IF(OR(AF26=\"So\",AF26=\"Sa\"),\"WE\",IF(November!$M33=\"\",\"-\",November!$M33)),0)","v":"-"},1,{"$f":"Dezember!$A33","v":"Do"},{"$f":"IF(AI26<>0,IF(OR(AI26=\"So\",AI26=\"Sa\"),\"WE\",IF(Dezember!$M33=\"\",\"-\",Dezember!$M33)),0)","v":"FT"},0]
[null,{"$f":"Januar!A34","v":"So"},{"$f":"IF(B27<>0,IF(OR(B27=\"So\",B27=\"Sa\"),\"WE\",IF(Januar!M34=\"\",\"-\",Januar!M34)),0)","v":"WE"},0,{"$f":"Februar!A34","v":"Mi"},{"$f":"IF(E27<>0,IF(OR(E27=\"So\",E27=\"Sa\"),\"WE\",IF(Februar!M34=\"\",\"-\",Februar!M34)),0)","v":"-"},1,{"$f":"März!$A34","v":"Mi"},{"$f":"IF(H27<>0,IF(OR(H27=\"So\",H27=\"Sa\"),\"WE\",IF(März!$M34=\"\",\"-\",März!$M34)),0)","v":"-"},1,{"$f":"April!$A34","v":"Sa"},{"$f":"IF(K27<>0,IF(OR(K27=\"So\",K27=\"Sa\"),\"WE\",IF(April!$M34=\"\",\"-\",April!$M34)),0)","v":"WE"},0,{"$f":"Mai!$A34","v":"Mo"},{"$f":"IF(N27<>0,IF(OR(N27=\"So\",N27=\"Sa\"),\"WE\",IF(Mai!$M34=\"\",\"-\",Mai!$M34)),0)","v":"FT"},0,{"$f":"Juni!$A34","v":"Do"},{"$f":"IF(Q27<>0,IF(OR(Q27=\"So\",Q27=\"Sa\"),\"WE\",IF(Juni!$M34=\"\",\"-\",Juni!$M34)),0)","v":"-"},1,{"$f":"Juli!$A34","v":"Sa"},{"$f":"IF(T27<>0,IF(OR(T27=\"So\",T27=\"Sa\"),\"WE\",IF(Juli!$M34=\"\",\"-\",Juli!$M34)),0)","v":"WE"},0,{"$f":"August!$A34","v":"Di"},{"$f":"IF(W27<>0,IF(OR(W27=\"So\",W27=\"Sa\"),\"WE\",IF(August!$M34=\"\",\"-\",August!$M34)),0)","v":"-"},1,{"$f":"September!$A34","v":"Fr"},{"$f":"IF(Z27<>0,IF(OR(Z27=\"So\",Z27=\"Sa\"),\"WE\",IF(September!$M34=\"\",\"-\",September!$M34)),0)","v":"-"},1,{"$f":"Oktober!$A34","v":"So"},{"$f":"IF(AC27<>0,IF(OR(AC27=\"So\",AC27=\"Sa\"),\"WE\",IF(Oktober!$M34=\"\",\"-\",Oktober!$M34)),0)","v":"WE"},0,{"$f":"November!$A34","v":"Mi"},{"$f":"IF(AF27<>0,IF(OR(AF27=\"So\",AF27=\"Sa\"),\"WE\",IF(November!$M34=\"\",\"-\",November!$M34)),0)","v":"-"},1,{"$f":"Dezember!$A34","v":"Fr"},{"$f":"IF(AI27<>0,IF(OR(AI27=\"So\",AI27=\"Sa\"),\"WE\",IF(Dezember!$M34=\"\",\"-\",Dezember!$M34)),0)","v":"FT"},0]
[null,{"$f":"Januar!A35","v":"Mo"},{"$f":"IF(B28<>0,IF(OR(B28=\"So\",B28=\"Sa\"),\"WE\",IF(Januar!M35=\"\",\"-\",Januar!M35)),0)","v":"-"},1,{"$f":"Februar!A35","v":"Do"},{"$f":"IF(E28<>0,IF(OR(E28=\"So\",E28=\"Sa\"),\"WE\",IF(Februar!M35=\"\",\"-\",Februar!M35)),0)","v":"-"},1,{"$f":"März!$A35","v":"Do"},{"$f":"IF(H28<>0,IF(OR(H28=\"So\",H28=\"Sa\"),\"WE\",IF(März!$M35=\"\",\"-\",März!$M35)),0)","v":"-"},1,{"$f":"April!$A35","v":"So"},{"$f":"IF(K28<>0,IF(OR(K28=\"So\",K28=\"Sa\"),\"WE\",IF(April!$M35=\"\",\"-\",April!$M35)),0)","v":"WE"},0,{"$f":"Mai!$A35","v":"Di"},{"$f":"IF(N28<>0,IF(OR(N28=\"So\",N28=\"Sa\"),\"WE\",IF(Mai!$M35=\"\",\"-\",Mai!$M35)),0)","v":"-"},1,{"$f":"Juni!$A35","v":"Fr"},{"$f":"IF(Q28<>0,IF(OR(Q28=\"So\",Q28=\"Sa\"),\"WE\",IF(Juni!$M35=\"\",\"-\",Juni!$M35)),0)","v":"-"},1,{"$f":"Juli!$A35","v":"So"},{"$f":"IF(T28<>0,IF(OR(T28=\"So\",T28=\"Sa\"),\"WE\",IF(Juli!$M35=\"\",\"-\",Juli!$M35)),0)","v":"WE"},0,{"$f":"August!$A35","v":"Mi"},{"$f":"IF(W28<>0,IF(OR(W28=\"So\",W28=\"Sa\"),\"WE\",IF(August!$M35=\"\",\"-\",August!$M35)),0)","v":"-"},1,{"$f":"September!$A35","v":"Sa"},{"$f":"IF(Z28<>0,IF(OR(Z28=\"So\",Z28=\"Sa\"),\"WE\",IF(September!$M35=\"\",\"-\",September!$M35)),0)","v":"WE"},0,{"$f":"Oktober!$A35","v":"Mo"},{"$f":"IF(AC28<>0,IF(OR(AC28=\"So\",AC28=\"Sa\"),\"WE\",IF(Oktober!$M35=\"\",\"-\",Oktober!$M35)),0)","v":"-"},1,{"$f":"November!$A35","v":"Do"},{"$f":"IF(AF28<>0,IF(OR(AF28=\"So\",AF28=\"Sa\"),\"WE\",IF(November!$M35=\"\",\"-\",November!$M35)),0)","v":"-"},1,{"$f":"Dezember!$A35","v":"Sa"},{"$f":"IF(AI28<>0,IF(OR(AI28=\"So\",AI28=\"Sa\"),\"WE\",IF(Dezember!$M35=\"\",\"-\",Dezember!$M35)),0)","v":"WE"},0]
[null,{"$f":"Januar!A36","v":"Di"},{"$f":"IF(B29<>0,IF(OR(B29=\"So\",B29=\"Sa\"),\"WE\",IF(Januar!M36=\"\",\"-\",Januar!M36)),0)","v":"-"},1,{"$f":"Februar!A36","v":"Fr"},{"$f":"IF(E29<>0,IF(OR(E29=\"So\",E29=\"Sa\"),\"WE\",IF(Februar!M36=\"\",\"-\",Februar!M36)),0)","v":"-"},1,{"$f":"März!$A36","v":"Fr"},{"$f":"IF(H29<>0,IF(OR(H29=\"So\",H29=\"Sa\"),\"WE\",IF(März!$M36=\"\",\"-\",März!$M36)),0)","v":"-"},1,{"$f":"April!$A36","v":"Mo"},{"$f":"IF(K29<>0,IF(OR(K29=\"So\",K29=\"Sa\"),\"WE\",IF(April!$M36=\"\",\"-\",April!$M36)),0)","v":"-"},1,{"$f":"Mai!$A36","v":"Mi"},{"$f":"IF(N29<>0,IF(OR(N29=\"So\",N29=\"Sa\"),\"WE\",IF(Mai!$M36=\"\",\"-\",Mai!$M36)),0)","v":"-"},1,{"$f":"Juni!$A36","v":"Sa"},{"$f":"IF(Q29<>0,IF(OR(Q29=\"So\",Q29=\"Sa\"),\"WE\",IF(Juni!$M36=\"\",\"-\",Juni!$M36)),0)","v":"WE"},0,{"$f":"Juli!$A36","v":"Mo"},{"$f":"IF(T29<>0,IF(OR(T29=\"So\",T29=\"Sa\"),\"WE\",IF(Juli!$M36=\"\",\"-\",Juli!$M36)),0)","v":"-"},1,{"$f":"August!$A36","v":"Do"},{"$f":"IF(W29<>0,IF(OR(W29=\"So\",W29=\"Sa\"),\"WE\",IF(August!$M36=\"\",\"-\",August!$M36)),0)","v":"-"},1,{"$f":"September!$A36","v":"So"},{"$f":"IF(Z29<>0,IF(OR(Z29=\"So\",Z29=\"Sa\"),\"WE\",IF(September!$M36=\"\",\"-\",September!$M36)),0)","v":"WE"},0,{"$f":"Oktober!$A36","v":"Di"},{"$f":"IF(AC29<>0,IF(OR(AC29=\"So\",AC29=\"Sa\"),\"WE\",IF(Oktober!$M36=\"\",\"-\",Oktober!$M36)),0)","v":"-"},1,{"$f":"November!$A36","v":"Fr"},{"$f":"IF(AF29<>0,IF(OR(AF29=\"So\",AF29=\"Sa\"),\"WE\",IF(November!$M36=\"\",\"-\",November!$M36)),0)","v":"-"},1,{"$f":"Dezember!$A36","v":"So"},{"$f":"IF(AI29<>0,IF(OR(AI29=\"So\",AI29=\"Sa\"),\"WE\",IF(Dezember!$M36=\"\",\"-\",Dezember!$M36)),0)","v":"WE"},0]
[null,{"$f":"Januar!A37","v":"Mi"},{"$f":"IF(B30<>0,IF(OR(B30=\"So\",B30=\"Sa\"),\"WE\",IF(Januar!M37=\"\",\"-\",Januar!M37)),0)","v":"-"},1,{"$f":"Februar!A37","v":"Sa"},{"$f":"IF(E30<>0,IF(OR(E30=\"So\",E30=\"Sa\"),\"WE\",IF(Februar!M37=\"\",\"-\",Februar!M37)),0)","v":"WE"},0,{"$f":"März!$A37","v":"Sa"},{"$f":"IF(H30<>0,IF(OR(H30=\"So\",H30=\"Sa\"),\"WE\",IF(März!$M37=\"\",\"-\",März!$M37)),0)","v":"WE"},0,{"$f":"April!$A37","v":"Di"},{"$f":"IF(K30<>0,IF(OR(K30=\"So\",K30=\"Sa\"),\"WE\",IF(April!$M37=\"\",\"-\",April!$M37)),0)","v":"-"},1,{"$f":"Mai!$A37","v":"Do"},{"$f":"IF(N30<>0,IF(OR(N30=\"So\",N30=\"Sa\"),\"WE\",IF(Mai!$M37=\"\",\"-\",Mai!$M37)),0)","v":"-"},1,{"$f":"Juni!$A37","v":"So"},{"$f":"IF(Q30<>0,IF(OR(Q30=\"So\",Q30=\"Sa\"),\"WE\",IF(Juni!$M37=\"\",\"-\",Juni!$M37)),0)","v":"WE"},0,{"$f":"Juli!$A37","v":"Di"},{"$f":"IF(T30<>0,IF(OR(T30=\"So\",T30=\"Sa\"),\"WE\",IF(Juli!$M37=\"\",\"-\",Juli!$M37)),0)","v":"-"},1,{"$f":"August!$A37","v":"Fr"},{"$f":"IF(W30<>0,IF(OR(W30=\"So\",W30=\"Sa\"),\"WE\",IF(August!$M37=\"\",\"-\",August!$M37)),0)","v":"-"},1,{"$f":"September!$A37","v":"Mo"},{"$f":"IF(Z30<>0,IF(OR(Z30=\"So\",Z30=\"Sa\"),\"WE\",IF(September!$M37=\"\",\"-\",September!$M37)),0)","v":"-"},1,{"$f":"Oktober!$A37","v":"Mi"},{"$f":"IF(AC30<>0,IF(OR(AC30=\"So\",AC30=\"Sa\"),\"WE\",IF(Oktober!$M37=\"\",\"-\",Oktober!$M37)),0)","v":"-"},1,{"$f":"November!$A37","v":"Sa"},{"$f":"IF(AF30<>0,IF(OR(AF30=\"So\",AF30=\"Sa\"),\"WE\",IF(November!$M37=\"\",\"-\",November!$M37)),0)","v":"WE"},0,{"$f":"Dezember!$A37","v":"Mo"},{"$f":"IF(AI30<>0,IF(OR(AI30=\"So\",AI30=\"Sa\"),\"WE\",IF(Dezember!$M37=\"\",\"-\",Dezember!$M37)),0)","v":"-"},1]
[null,{"$f":"Januar!A38","v":"Do"},{"$f":"IF(B31<>0,IF(OR(B31=\"So\",B31=\"Sa\"),\"WE\",IF(Januar!M38=\"\",\"-\",Januar!M38)),0)","v":"-"},1,{"$f":"Februar!A38","v":"Sa"},{"$f":"IF(E31<>0,IF(OR(E31=\"So\",E31=\"Sa\"),\"WE\",IF(Februar!M38=\"\",\"-\",Februar!M38)),0)","v":"WE"},0,{"$f":"März!$A38","v":"So"},{"$f":"IF(H31<>0,IF(OR(H31=\"So\",H31=\"Sa\"),\"WE\",IF(März!$M38=\"\",\"-\",März!$M38)),0)","v":"WE"},0,{"$f":"April!$A38","v":"Mi"},{"$f":"IF(K31<>0,IF(OR(K31=\"So\",K31=\"Sa\"),\"WE\",IF(April!$M38=\"\",\"-\",April!$M38)),0)","v":"-"},1,{"$f":"Mai!$A38","v":"Fr"},{"$f":"IF(N31<>0,IF(OR(N31=\"So\",N31=\"Sa\"),\"WE\",IF(Mai!$M38=\"\",\"-\",Mai!$M38)),0)","v":"-"},1,{"$f":"Juni!$A38","v":"Mo"},{"$f":"IF(Q31<>0,IF(OR(Q31=\"So\",Q31=\"Sa\"),\"WE\",IF(Juni!$M38=\"\",\"-\",Juni!$M38)),0)","v":"-"},1,{"$f":"Juli!$A38","v":"Mi"},{"$f":"IF(T31<>0,IF(OR(T31=\"So\",T31=\"Sa\"),\"WE\",IF(Juli!$M38=\"\",\"-\",Juli!$M38)),0)","v":"-"},1,{"$f":"August!$A38","v":"Sa"},{"$f":"IF(W31<>0,IF(OR(W31=\"So\",W31=\"Sa\"),\"WE\",IF(August!$M38=\"\",\"-\",August!$M38)),0)","v":"WE"},0,{"$f":"September!$A38","v":"Di"},{"$f":"IF(Z31<>0,IF(OR(Z31=\"So\",Z31=\"Sa\"),\"WE\",IF(September!$M38=\"\",\"-\",September!$M38)),0)","v":"-"},1,{"$f":"Oktober!$A38","v":"Do"},{"$f":"IF(AC31<>0,IF(OR(AC31=\"So\",AC31=\"Sa\"),\"WE\",IF(Oktober!$M38=\"\",\"-\",Oktober!$M38)),0)","v":"-"},1,{"$f":"November!$A38","v":"So"},{"$f":"IF(AF31<>0,IF(OR(AF31=\"So\",AF31=\"Sa\"),\"WE\",IF(November!$M38=\"\",\"-\",November!$M38)),0)","v":"WE"},0,{"$f":"Dezember!$A38","v":"Di"},{"$f":"IF(AI31<>0,IF(OR(AI31=\"So\",AI31=\"Sa\"),\"WE\",IF(Dezember!$M38=\"\",\"-\",Dezember!$M38)),0)","v":"-"},1]
[null,{"$f":"Januar!A39","v":"Fr"},{"$f":"IF(B32<>0,IF(OR(B32=\"So\",B32=\"Sa\"),\"WE\",IF(Januar!M39=\"\",\"-\",Januar!M39)),0)","v":"-"},1,{"$f":"Februar!A39","v":0},{"$f":"IF(E32<>0,IF(OR(E32=\"So\",E32=\"Sa\"),\"WE\",IF(Februar!M39=\"\",\"-\",Februar!M39)),0)","v":0},0,{"$f":"März!$A39","v":"Mo"},{"$f":"IF(H32<>0,IF(OR(H32=\"So\",H32=\"Sa\"),\"WE\",IF(März!$M39=\"\",\"-\",März!$M39)),0)","v":"-"},1,{"$f":"April!$A39","v":"Do"},{"$f":"IF(K32<>0,IF(OR(K32=\"So\",K32=\"Sa\"),\"WE\",IF(April!$M39=\"\",\"-\",April!$M39)),0)","v":"-"},1,{"$f":"Mai!$A39","v":"Sa"},{"$f":"IF(N32<>0,IF(OR(N32=\"So\",N32=\"Sa\"),\"WE\",IF(Mai!$M39=\"\",\"-\",Mai!$M39)),0)","v":"WE"},0,{"$f":"Juni!$A39","v":"Di"},{"$f":"IF(Q32<>0,IF(OR(Q32=\"So\",Q32=\"Sa\"),\"WE\",IF(Juni!$M39=\"\",\"-\",Juni!$M39)),0)","v":"-"},1,{"$f":"Juli!$A39","v":"Do"},{"$f":"IF(T32<>0,IF(OR(T32=\"So\",T32=\"Sa\"),\"WE\",IF(Juli!$M39=\"\",\"-\",Juli!$M39)),0)","v":"-"},1,{"$f":"August!$A39","v":"So"},{"$f":"IF(W32<>0,IF(OR(W32=\"So\",W32=\"Sa\"),\"WE\",IF(August!$M39=\"\",\"-\",August!$M39)),0)","v":"WE"},0,{"$f":"September!$A39","v":"Mi"},{"$f":"IF(Z32<>0,IF(OR(Z32=\"So\",Z32=\"Sa\"),\"WE\",IF(September!$M39=\"\",\"-\",September!$M39)),0)","v":"-"},1,{"$f":"Oktober!$A39","v":"Fr"},{"$f":"IF(AC32<>0,IF(OR(AC32=\"So\",AC32=\"Sa\"),\"WE\",IF(Oktober!$M39=\"\",\"-\",Oktober!$M39)),0)","v":"-"},1,{"$f":"November!$A39","v":"Mo"},{"$f":"IF(AF32<>0,IF(OR(AF32=\"So\",AF32=\"Sa\"),\"WE\",IF(November!$M39=\"\",\"-\",November!$M39)),0)","v":"-"},1,{"$f":"Dezember!$A39","v":"Mi"},{"$f":"IF(AI32<>0,IF(OR(AI32=\"So\",AI32=\"Sa\"),\"WE\",IF(Dezember!$M39=\"\",\"-\",Dezember!$M39)),0)","v":"-"},1]
[null,{"$f":"Januar!A40","v":"Sa"},{"$f":"IF(B33<>0,IF(OR(B33=\"So\",B33=\"Sa\"),\"WE\",IF(Januar!M40=\"\",\"-\",Januar!M40)),0)","v":"WE"},0,{"$f":"Februar!A40","v":0},{"$f":"IF(E33<>0,IF(OR(E33=\"So\",E33=\"Sa\"),\"WE\",IF(Februar!M40=\"\",\"-\",Februar!M40)),0)","v":0},0,{"$f":"März!$A40","v":"Di"},{"$f":"IF(H33<>0,IF(OR(H33=\"So\",H33=\"Sa\"),\"WE\",IF(März!$M40=\"\",\"-\",März!$M40)),0)","v":"-"},1,{"$f":"April!$A40","v":0},{"$f":"IF(K33<>0,IF(OR(K33=\"So\",K33=\"Sa\"),\"WE\",IF(April!$M40=\"\",\"-\",April!$M40)),0)","v":0},0,{"$f":"Mai!$A40","v":"So"},{"$f":"IF(N33<>0,IF(OR(N33=\"So\",N33=\"Sa\"),\"WE\",IF(Mai!$M40=\"\",\"-\",Mai!$M40)),0)","v":"WE"},0,{"$f":"Juni!$A40","v":0},{"$f":"IF(Q33<>0,IF(OR(Q33=\"So\",Q33=\"Sa\"),\"WE\",IF(Juni!$M40=\"\",\"-\",Juni!$M40)),0)","v":0},0,{"$f":"Juli!$A40","v":"Fr"},{"$f":"IF(T33<>0,IF(OR(T33=\"So\",T33=\"Sa\"),\"WE\",IF(Juli!$M40=\"\",\"-\",Juli!$M40)),0)","v":"-"},1,{"$f":"August!$A40","v":"Mo"},{"$f":"IF(W33<>0,IF(OR(W33=\"So\",W33=\"Sa\"),\"WE\",IF(August!$M40=\"\",\"-\",August!$M40)),0)","v":"-"},1,{"$f":"September!$A40","v":0},{"$f":"IF(Z33<>0,IF(OR(Z33=\"So\",Z33=\"Sa\"),\"WE\",IF(September!$M40=\"\",\"-\",September!$M40)),0)","v":0},0,{"$f":"Oktober!$A40","v":"Sa"},{"$f":"IF(AC33<>0,IF(OR(AC33=\"So\",AC33=\"Sa\"),\"WE\",IF(Oktober!$M40=\"\",\"-\",Oktober!$M40)),0)","v":"WE"},0,{"$f":"November!$A40","v":0},{"$f":"IF(AF33<>0,IF(OR(AF33=\"So\",AF33=\"Sa\"),\"WE\",IF(November!$M40=\"\",\"-\",November!$M40)),0)","v":0},0,{"$f":"Dezember!$A40","v":"Do"},{"$f":"IF(AI33<>0,IF(OR(AI33=\"So\",AI33=\"Sa\"),\"WE\",IF(Dezember!$M40=\"\",\"-\",Dezember!$M40)),0)","v":"FT"},0]
[null,{"$f":"Januar!A41","v":0},{"$f":"IF(B34<>0,IF(OR(B34=\"So\",B34=\"Sa\"),\"WE\",IF(Januar!M41=\"\",\"-\",Januar!M41)),0)","v":0},0,{"$f":"Februar!A41","v":0},{"$f":"IF(E34<>0,IF(OR(E34=\"So\",E34=\"Sa\"),\"WE\",IF(Februar!M41=\"\",\"-\",Februar!M41)),0)","v":0},0,{"$f":"März!$A41","v":0},{"$f":"IF(H34<>0,IF(OR(H34=\"So\",H34=\"Sa\"),\"WE\",IF(März!$M41=\"\",\"-\",März!$M41)),0)","v":0},0,{"$f":"April!$A41","v":0},{"$f":"IF(K34<>0,IF(OR(K34=\"So\",K34=\"Sa\"),\"WE\",IF(April!$M41=\"\",\"-\",April!$M41)),0)","v":0},0,{"$f":"Mai!$A41","v":0},{"$f":"IF(N34<>0,IF(OR(N34=\"So\",N34=\"Sa\"),\"WE\",IF(Mai!$M41=\"\",\"-\",Mai!$M41)),0)","v":0},0,{"$f":"Juni!$A41","v":0},{"$f":"IF(Q34<>0,IF(OR(Q34=\"So\",Q34=\"Sa\"),\"WE\",IF(Juni!$M41=\"\",\"-\",Juni!$M41)),0)","v":0},0,{"$f":"Juli!$A41","v":0},{"$f":"IF(T34<>0,IF(OR(T34=\"So\",T34=\"Sa\"),\"WE\",IF(Juli!$M41=\"\",\"-\",Juli!$M41)),0)","v":0},0,{"$f":"August!$A41","v":0},{"$f":"IF(W34<>0,IF(OR(W34=\"So\",W34=\"Sa\"),\"WE\",IF(August!$M41=\"\",\"-\",August!$M41)),0)","v":0},0,{"$f":"September!$A41","v":0},{"$f":"IF(Z34<>0,IF(OR(Z34=\"So\",Z34=\"Sa\"),\"WE\",IF(September!$M41=\"\",\"-\",September!$M41)),0)","v":0},0,{"$f":"Oktober!$A41","v":0},{"$f":"IF(AC34<>0,IF(OR(AC34=\"So\",AC34=\"Sa\"),\"WE\",IF(Oktober!$M41=\"\",\"-\",Oktober!$M41)),0)","v":0},0,{"$f":"November!$A41","v":0},{"$f":"IF(AF34<>0,IF(OR(AF34=\"So\",AF34=\"Sa\"),\"WE\",IF(November!$M41=\"\",\"-\",November!$M41)),0)","v":0},0,{"$f":"Dezember!$A41","v":0},{"$f":"IF(AI34<>0,IF(OR(AI34=\"So\",AI34=\"Sa\"),\"WE\",IF(Dezember!$M41=\"\",\"-\",Dezember!$M41)),0)","v":0},0]
[null,{"$f":"Januar!A42","v":0},{"$f":"IF(OR(B35=\"So\",B35=\"Sa\"),\"WE\",IF(Januar!M42=\"\",\"-\",Januar!M42))","v":0},0,{"$f":"Februar!A42","v":0},{"$f":"IF(E35<>0,IF(OR(E35=\"So\",E35=\"Sa\"),\"WE\",IF(Februar!M42=\"\",\"-\",Februar!M42)),0)","v":0},0,{"$f":"März!$A42","v":0},{"$f":"IF(H35<>0,IF(OR(H35=\"So\",H35=\"Sa\"),\"WE\",IF(März!$M42=\"\",\"-\",März!$M42)),0)","v":0},0,{"$f":"April!$A42","v":0},{"$f":"IF(K35<>0,IF(OR(K35=\"So\",K35=\"Sa\"),\"WE\",IF(April!$M42=\"\",\"-\",April!$M42)),0)","v":0},0,{"$f":"Mai!$A42","v":0},{"$f":"IF(N35<>0,IF(OR(N35=\"So\",N35=\"Sa\"),\"WE\",IF(Mai!$M42=\"\",\"-\",Mai!$M42)),0)","v":0},0,{"$f":"Juni!$A42","v":0},{"$f":"IF(Q35<>0,IF(OR(Q35=\"So\",Q35=\"Sa\"),\"WE\",IF(Juni!$M42=\"\",\"-\",Juni!$M42)),0)","v":0},0,{"$f":"Juli!$A42","v":0},{"$f":"IF(T35<>0,IF(OR(T35=\"So\",T35=\"Sa\"),\"WE\",IF(Juli!$M42=\"\",\"-\",Juli!$M42)),0)","v":0},0,{"$f":"August!$A42","v":0},{"$f":"IF(W35<>0,IF(OR(W35=\"So\",W35=\"Sa\"),\"WE\",IF(August!$M42=\"\",\"-\",August!$M42)),0)","v":0},0,{"$f":"September!$A42","v":0},{"$f":"IF(Z35<>0,IF(OR(Z35=\"So\",Z35=\"Sa\"),\"WE\",IF(September!$M42=\"\",\"-\",September!$M42)),0)","v":0},0,{"$f":"Oktober!$A42","v":0},{"$f":"IF(AC35<>0,IF(OR(AC35=\"So\",AC35=\"Sa\"),\"WE\",IF(Oktober!$M42=\"\",\"-\",Oktober!$M42)),0)","v":0},0,{"$f":"November!$A42","v":0},{"$f":"IF(AF35<>0,IF(OR(AF35=\"So\",AF35=\"Sa\"),\"WE\",IF(November!$M42=\"\",\"-\",November!$M42)),0)","v":0},0,{"$f":"Dezember!$A42","v":0},{"$f":"IF(AI35<>0,IF(OR(AI35=\"So\",AI35=\"Sa\"),\"WE\",IF(Dezember!$M42=\"\",\"-\",Dezember!$M42)),0)","v":0},0]
[null,null,{"$f":"COUNTIF(C3:C35,\"HO\")","v":0},{"$f":"SUM(D3:D35)","v":19},null,{"$f":"COUNTIF(F3:F35,\"HO\")","v":0},{"$f":"SUM(G3:G35)","v":20},null,{"$f":"COUNTIF(I3:I35,\"HO\")","v":0},{"$f":"SUM(J3:J35)","v":22},null,{"$f":"COUNTIF(L3:L35,\"HO\")","v":0},{"$f":"SUM(M3:M35)","v":20},null,{"$f":"COUNTIF(O3:O35,\"HO\")","v":0},{"$f":"SUM(P3:P35)","v":18},null,{"$f":"COUNTIF(R3:R35,\"HO\")","v":0},{"$f":"SUM(S3:S35)","v":21},null,{"$f":"COUNTIF(U3:U35,\"HO\")","v":0},{"$f":"SUM(V3:V35)","v":23},null,{"$f":"COUNTIF(X3:X35,\"HO\")","v":0},{"$f":"SUM(Y3:Y35)","v":21},null,{"$f":"COUNTIF(AA3:AA35,\"HO\")","v":0},{"$f":"SUM(AB3:AB35)","v":22},null,{"$f":"COUNTIF(AD3:AD35,\"HO\")","v":0},{"$f":"SUM(AE3:AE35)","v":22},null,{"$f":"COUNTIF(AG3:AG35,\"HO\")","v":0},{"$f":"SUM(AH3:AH35)","v":21},null,{"$f":"COUNTIF(AJ3:AJ35,\"HO\")","v":0},{"$f":"SUM(AK3:AK35)","v":20}]
["%HO:",null,{"$f":"C36/D36","v":0},null,null,{"$f":"F36/G36","v":0},null,null,{"$f":"I36/J36","v":0},null,null,{"$f":"L36/M36","v":0},null,null,{"$f":"O36/P36","v":0},null,null,{"$f":"R36/S36","v":0},null,null,{"$f":"U36/V36","v":0},null,null,{"$f":"X36/Y36","v":0},null,null,{"$f":"AA36/AB36","v":0},null,null,{"$f":"AD36/AE36","v":0},null,null,{"$f":"AG36/AH36","v":0},null,null,{"$f":"AJ36/AK36","v":0}]

{"sheet":"Feiertage","index":15,"n_rows":30,"n_cols":12,"rows_kept":30,"cut":false,"hidden":true,"merged":[]}
[{"$f":"YEAR(Januar!E4)","v":2026},"Bereich Feiertage",null,"Bereich Jahre",null,"Werte_Abwesenheitsart",null,"Datum_Freigabe",null,null,"Text_Wochentag"]
[{"$f":"FLOOR(DAY(MINUTE(A1/38)/2+56)&\"/5/\"&A1,7)-33","v":"2022-04-04"},"Ostersonntag",null,{"$f":"DATE(Jahr_Freigabe-1,1,1)","v":"2019-12-31"},null,"FT",null,"12/2025",null,null,1,"Mo"]
[{"$f":"Ostersonntag-2","v":"2022-04-02"},"Karfreitag ",null,{"$f":"DATE(YEAR(D2)+1,1,1)","v":"2020-12-31"},null,"U",null,null,null,null,2,"Di"]
[{"$f":"Ostersonntag+1","v":"2022-04-05"},"Ostermontag",null,{"$f":"DATE(YEAR(D3)+1,1,1)","v":"2021-12-31"},null,"GT",null,"Jahr_Freigabe",null,null,3,"Mi"]
[{"$f":"DATE($A$1,\"05\",\"01\")","v":"2022-04-30"},"Tag der Arbeit",null,"2022-12-31",null,"SD/SS",null,2025,null,null,4,"Do"]
[{"$f":"Ostersonntag + 39","v":"2022-05-13"},"Christi Himmelfahrt",null,"2023-12-31",null,"K",null,"für Hinweis bei Ändern des Jahres im Januar",null,null,5,"Fr"]
[{"$f":"Ostersonntag + 49","v":"2022-05-23"},"Pfingstsonntag ",null,"2024-12-31",null,"HO/mW",null,null,null,null,6,"Sa"]
[{"$f":"Ostersonntag + 50","v":"2022-05-24"},"Pfingstmontag ",null,"2025-12-31",null,null,null,"Version_Freigabe",null,null,7,"So"]
[{"$f":"Ostersonntag + 60","v":"2022-06-03"},"Fronleichnam ",null,"2026-12-31",null,"Show_MissingEntries",null,"2026.1"]
[{"$f":"DATE($A$1,\"01\",\"01\")","v":"2021-12-31"},"Neujahr",null,null,null,true,null,null,null,null,"Text_Monatsname"]
[{"$f":"DATE($A$1,\"01\",\"06\")","v":"2022-01-05"},"Heilige drei Könige",null,null,null,null,null,null,null,null,1,"Januar"]
[{"$f":"DATE($A$1,\"08\",\"15\")","v":"2022-08-14"},"Mariä Himmelfahrt",null,null,null,null,null,null,null,null,2,"Februar"]
[{"$f":"DATE($A$1,\"10\",\"3\")","v":"2022-10-02"},"Tag der Deutschen Einheit",null,null,null,null,null,null,null,null,3,"März"]
[{"$f":"DATE($A$1,\"11\",\"1\")","v":"2022-10-31"},"Allerheiligen",null,null,null,null,null,null,null,null,4,"April"]
[{"$f":"DATE($A$1,\"12\",\"24\")","v":"2022-12-23"},"Heilig Abend",null,null,null,null,null,null,null,null,5,"Mai"]
[{"$f":"DATE($A$1,\"12\",\"25\")","v":"2022-12-24"},"1. Weihnachtstag",null,null,null,null,null,null,null,null,6,"Juni"]
[{"$f":"DATE($A$1,\"12\",\"26\")","v":"2022-12-25"},"2. Weihnachtstag ",null,null,null,null,null,null,null,null,7,"Juli"]
[{"$f":"DATE($A$1,\"12\",\"31\")","v":"2022-12-30"},"Silvester",null,null,null,null,null,null,null,null,8,"August"]
[null,null,null,null,null,null,null,null,null,null,9,"September"]
[null,null,null,null,null,null,null,null,null,null,10,"Oktober"]
[null,null,null,null,null,null,null,null,null,null,11,"November"]
[null,null,null,null,null,null,null,null,null,null,12,"Dezember"]
["Änderungsnotizen"]
["Freigabe","Name bzw. Änderungen"]
["2021-12-10","Kreitmaier, Florian"]
[null,"Eintragung zusätzlicher Reisezeiten"]
[null,"korrekte Saldoberechnung unter Einebziehung aller geleisteter Stunden"]
[null,"Möglichkeit der Abrechnung entgeltlich abgegoltener Mehrstunden"]
["2020-06-04","Kreitmaier, Florian"]
[null,"Anmerkungen bei fehlenden Pausen eingefügt"]

{"sheet":"Test","index":16,"n_rows":80,"n_cols":13,"rows_kept":80,"cut":false,"hidden":true,"merged":[[8,1,8,12],[1,1,1,12],[2,1,2,12],[3,1,3,12],[4,1,4,12],[6,1,6,12],[7,1,7,12]]}
[]
[null,"Achtung:"]
[null,"Diese Übersicht über Ihre Urlaubstage hat keinerlei offiziellen Charakter. Eintragungen (oder auch Fehler) in dieser Datei haben keinerlei Auswirkungen auf Ihre tatsächlichen Urlaubstage."]
[null,"Ein Eintrag hier ist keine offizielle Beantragung oder Genehmigung Ihres Urlaubs!"]
[null,"Bitte nutzen Sie dazu die jeweils für Sie verbindlichen Verfahren. Nur Eintragungen dort sind für Sie gültig."]
[]
[null,"Sie können diese Seite aber gerne unverbindlich für Ihren persönichen Überblick und Notizen nutzen."]
[null,"Falls Sie Ihren Resturlaub nicht fristgerecht nehmen können (in der Regel bis 31. März vollständig genommen - erkundigen Sie sich bitte bei Ihrer zuständigen Personalabteilung bzgl. des für Sie relevanten Stichtags), müssen Sie sich frühzeitig bei Ihrem Vorgesetzten um eine Verlängerung bemühen. Andernfalls verfallen die Tage **)."]
[null,"*)   Bitte beachten Sie, dass sich bei rückwirkender Änderung von Urlaubstagen Ihre Notizen nicht mit verschieben.\n**) Dieses Tool geht bei der Berechnung der Anzahl Ihrer Urlaubstage davon aus, dass ggf. die Verlängerung genehmigt wurden. \n     Anderfalls bitte Anzahl der Resturlaubstage anpassen."]
[]
[null,"Bitte tragen Sie ein:"]
[null,0,null,null,null,null,null,null,null,"Resturlaub Vorjahr",null,null,"nicht vergessen: Der Resturlaub muss bis 31.3. genommen werden!"]
[null,30,null,null,null,null,null,null,null,"Tariflicher Urlaubsanspruch laufendes Jahr",null,null,"bitte ggf. Teilzeitregelungen, etc. beachten."]
[null,null,null,null,null,null,null,null,null,"ggf. zusätzliche Urlaubstage",null,null,"z.B. aufgrund von Schwerbehinderung, Umzug, etc."]
[null,{"$f":"SUM(B12:B14)","v":30},null,null,null,null,null,null,null,"Summe",null,null,{"$f":"IF(B15<=Wert_Zeilenzahl_Urlaubstage,\"\",\"Bitte beachten Sie, dass maximal 75 Urlaubstage ausgewertet werden.\")","v":""}]
[]
[null,"Unverbindliche Übersicht über genommenen und geplanten Urlaub:"]
[]
[null,"Anzahl","Register","Vergangenheit","Vorjahr Ende","Vorjahr Termin","zuviel","Rest Gesamt","Datum",null,null,"Hinweis","Ihre Notizen *)"]
[null,0,"$V$10:$W$40",null,null,null,{"$f":"COUNTIF(G21:G80,\">\"&\" \")","v":0}]
[null,{"$f":"IF(OR(B20=Help!E$18,B20=\"\"),\"\",B20+1)","v":""},{"$f":"IF(B21=\"\",\"\",VLOOKUP(B21-1,Werte_UrlaubstageGenutzt,4,TRUE)&\"!\"&C$20)","v":""},{"$f":"IF(B21=\"\",\"\",IF(TODAY()>=I21,\"x\",\"\"))","v":""},{"$f":"IF(B21=\"\",\"\",IF(B21=B$12,\"letzter Tag des Resturlaubs\",\"\"))","v":""},{"$f":"IF(B21=\"\",\"\",IF(OR(MONTH(K21)<=3,B21>B$12),\"\",\"Resturlaub bis Ende März!\"))","v":""},{"$f":"IF(B21=\"\",\"\",IF(B21<=$B$15,\"\",\"Sie haben nur \"&B$15&\" Tage Urlaub!\"))","v":""},{"$f":"IF(AND(B21=\"\",B20<>\"\"),IF(G$20=0,\"noch verfügbar: \"&$B$15-B20,\"zuviel geplant: \"&B20-B$15)&\" Tage\",\"\")","v":"noch verfügbar: 30 Tage"},{"$f":"IF($B21=\"\",\"\",VLOOKUP($B21,INDIRECT($C21),2,FALSE))","v":""},{"$f":"IF($B21=\"\",\"\",VLOOKUP($B21,INDIRECT($C21),2,FALSE))","v":""},{"$f":"IF($B21=\"\",\"\",VLOOKUP($B21,INDIRECT($C21),2,FALSE))","v":""},{"$f":"IF(G21<>\"\",G21,IF(H21<>\"\",H21,IF(F21<>\"\",F21,IF(E21<>\"\",E21,\"\"))))","v":"noch verfügbar: 30 Tage"}]
[null,{"$f":"IF(OR(B21=Help!E$18,B21=\"\"),\"\",B21+1)","v":""},"",{"$f":"IF(B22=\"\",\"\",IF(TODAY()>=I22,\"x\",\"\"))","v":""},{"$f":"IF(B22=\"\",\"\",IF(B22=B$12,\"letzter Tag des Resturlaubs\",\"\"))","v":""},"","","",{"$f":"IF($B22=\"\",\"\",VLOOKUP($B22,INDIRECT($C22),2,FALSE))","v":""},"","",{"$f":"IF(G22<>\"\",G22,IF(H22<>\"\",H22,IF(F22<>\"\",F22,IF(E22<>\"\",E22,\"\"))))","v":""}]
[null,{"$f":"IF(OR(B22=Help!E$18,B22=\"\"),\"\",B22+1)","v":""},"","","","","","","","","",""]
[null,{"$f":"IF(OR(B23=Help!E$18,B23=\"\"),\"\",B23+1)","v":""},"","","","","","","","","",""]
[null,{"$f":"IF(OR(B24=Help!E$18,B24=\"\"),\"\",B24+1)","v":""},"","","","","","","","","",""]
[null,{"$f":"IF(OR(B25=Help!E$18,B25=\"\"),\"\",B25+1)","v":""},"","","","","","","","","",""]
[null,{"$f":"IF(OR(B26=Help!E$18,B26=\"\"),\"\",B26+1)","v":""},"","","","","","","","","",""]
[null,{"$f":"IF(OR(B27=Help!E$18,B27=\"\"),\"\",B27+1)","v":""},"","","","","","","","","",""]
[null,{"$f":"IF(OR(B28=Help!E$18,B28=\"\"),\"\",B28+1)","v":""},"","","","","","","","","",""]
[null,{"$f":"IF(OR(B29=Help!E$18,B29=\"\"),\"\",B29+1)","v":""},"","","","","","","","","",""]
[null,{"$f":"IF(OR(B30=Help!E$18,B30=\"\"),\"\",B30+1)","v":""},"","","","","","","","","",""]
[null,{"$f":"IF(OR(B31=Help!E$18,B31=\"\"),\"\",B31+1)","v":""},"","","","","","","","","",""]
[null,{"$f":"IF(OR(B32=Help!E$18,B32=\"\"),\"\",B32+1)","v":""},"","","","","","","","","",""]
[null,{"$f":"IF(OR(B33=Help!E$18,B33=\"\"),\"\",B33+1)","v":""},"","","","","","","","","",""]
[null,{"$f":"IF(OR(B34=Help!E$18,B34=\"\"),\"\",B34+1)","v":""},"","","","","","","","","",""]
[null,{"$f":"IF(OR(B35=Help!E$18,B35=\"\"),\"\",B35+1)","v":""},"","","","","","","","","",""]
[null,{"$f":"IF(OR(B36=Help!E$18,B36=\"\"),\"\",B36+1)","v":""},"","","","","","","","","",""]
[null,{"$f":"IF(OR(B37=Help!E$18,B37=\"\"),\"\",B37+1)","v":""},"","","","","","","","","",""]
[null,{"$f":"IF(OR(B38=Help!E$18,B38=\"\"),\"\",B38+1)","v":""},"","","","","","","","","",""]
[null,{"$f":"IF(OR(B39=Help!E$18,B39=\"\"),\"\",B39+1)","v":""},"","","","","","","","","",""]
[null,{"$f":"IF(OR(B40=Help!E$18,B40=\"\"),\"\",B40+1)","v":""},"","","","","","","","","",""]
[null,{"$f":"IF(OR(B41=Help!E$18,B41=\"\"),\"\",B41+1)","v":""},"","","","","","","","","",""]
[null,{"$f":"IF(OR(B42=Help!E$18,B42=\"\"),\"\",B42+1)","v":""},"","","","","","","","","",""]
[null,{"$f":"IF(OR(B43=Help!E$18,B43=\"\"),\"\",B43+1)","v":""},"","","","","","","","","",""]
[null,{"$f":"IF(OR(B44=Help!E$18,B44=\"\"),\"\",B44+1)","v":""},"","","","","","","","","",""]
[null,{"$f":"IF(OR(B45=Help!E$18,B45=\"\"),\"\",B45+1)","v":""},"","","","","","","","","",""]
[null,{"$f":"IF(OR(B46=Help!E$18,B46=\"\"),\"\",B46+1)","v":""},"","","","","","","","","",""]
[null,{"$f":"IF(OR(B47=Help!E$18,B47=\"\"),\"\",B47+1)","v":""},"","","","","","","","","",""]
[null,{"$f":"IF(OR(B48=Help!E$18,B48=\"\"),\"\",B48+1)","v":""},"","","","","","","","","",""]
[null,{"$f":"IF(OR(B49=Help!E$18,B49=\"\"),\"\",B49+1)","v":""},"","","","","","","","","",""]
[null,{"$f":"IF(OR(B50=Help!E$18,B50=\"\"),\"\",B50+1)","v":""},"","","","","","","","","",""]
[null,{"$f":"IF(OR(B51=Help!E$18,B51=\"\"),\"\",B51+1)","v":""},"","","","","","","","","",""]
[null,{"$f":"IF(OR(B52=Help!E$18,B52=\"\"),\"\",B52+1)","v":""},{"$f":"IF(B53=\"\",\"\",VLOOKUP(B53-1,Werte_UrlaubstageGenutzt,4,TRUE)&\"!\"&C$20)","v":""},"","",{"$f":"IF(B53=\"\",\"\",IF(OR(MONTH(K53)<=3,B53>B$12),\"\",\"Resturlaub bis Ende März!\"))","v":""},{"$f":"IF(B53=\"\",\"\",IF(B53<=$B$15,\"\",\"Sie haben nur \"&B$15&\" Tage Urlaub!\"))","v":""},{"$f":"IF(AND(B53=\"\",B52<>\"\"),IF(G$20=0,\"noch verfügbar: \"&$B$15-B52,\"zuviel geplant: \"&B52-B$15)&\" Tage\",\"\")","v":""},"","","",""]
[null,{"$f":"IF(OR(B53=Help!E$18,B53=\"\"),\"\",B53+1)","v":""},"","","","","","",{"$f":"IF($B54=\"\",\"\",VLOOKUP($B54,INDIRECT($C54),2,FALSE))","v":""},"","",""]
[null,{"$f":"IF(OR(B54=Help!E$18,B54=\"\"),\"\",B54+1)","v":""},"","","","","","","","","",""]
[null,{"$f":"IF(OR(B55=Help!E$18,B55=\"\"),\"\",B55+1)","v":""},"","","","","","","","","",""]
[null,{"$f":"IF(OR(B56=Help!E$18,B56=\"\"),\"\",B56+1)","v":""},"","","","","","","","","",""]
[null,{"$f":"IF(OR(B57=Help!E$18,B57=\"\"),\"\",B57+1)","v":""},"","","","","","","","","",""]
[null,{"$f":"IF(OR(B58=Help!E$18,B58=\"\"),\"\",B58+1)","v":""},"","","","","","","","","",""]
[null,{"$f":"IF(OR(B59=Help!E$18,B59=\"\"),\"\",B59+1)","v":""},"","","","","","","","","",""]
[null,{"$f":"IF(OR(B60=Help!E$18,B60=\"\"),\"\",B60+1)","v":""},"","","","","","","","","",""]
[null,{"$f":"IF(OR(B61=Help!E$18,B61=\"\"),\"\",B61+1)","v":""},"","","","","","","","","",""]
[null,{"$f":"IF(OR(B62=Help!E$18,B62=\"\"),\"\",B62+1)","v":""},"","","","","","","","","",""]
[null,{"$f":"IF(OR(B63=Help!E$18,B63=\"\"),\"\",B63+1)","v":""},"","","","","","","","","",""]
[null,{"$f":"IF(OR(B64=Help!E$18,B64=\"\"),\"\",B64+1)","v":""},"","","","","","","","","",""]
[null,{"$f":"IF(OR(B65=Help!E$18,B65=\"\"),\"\",B65+1)","v":""},"","","","","","","","","",""]
[null,{"$f":"IF(OR(B66=Help!E$18,B66=\"\"),\"\",B66+1)","v":""},"","","","","","","","","",""]
[null,{"$f":"IF(OR(B67=Help!E$18,B67=\"\"),\"\",B67+1)","v":""},"","","","","","","","","",""]
[null,{"$f":"IF(OR(B68=Help!E$18,B68=\"\"),\"\",B68+1)","v":""},"","","","","","","","","",""]
[null,{"$f":"IF(OR(B69=Help!E$18,B69=\"\"),\"\",B69+1)","v":""},"","","","","","","","","",""]
[null,{"$f":"IF(OR(B70=Help!E$18,B70=\"\"),\"\",B70+1)","v":""},"","","","","","","","","",""]
[null,{"$f":"IF(OR(B71=Help!E$18,B71=\"\"),\"\",B71+1)","v":""},"","","","","","","","","",""]
[null,{"$f":"IF(OR(B72=Help!E$18,B72=\"\"),\"\",B72+1)","v":""},"","","","","","","","","",""]
[null,{"$f":"IF(OR(B73=Help!E$18,B73=\"\"),\"\",B73+1)","v":""},"","","","","","","","","",""]
[null,{"$f":"IF(OR(B74=Help!E$18,B74=\"\"),\"\",B74+1)","v":""},"","","","","","","","","",""]
[null,{"$f":"IF(OR(B75=Help!E$18,B75=\"\"),\"\",B75+1)","v":""},"","","","","","","","","",""]
[null,{"$f":"IF(OR(B76=Help!E$18,B76=\"\"),\"\",B76+1)","v":""},"","","","","","","","","",""]
[null,{"$f":"IF(OR(B77=Help!E$18,B77=\"\"),\"\",B77+1)","v":""},"","","","","","","","","",""]
[null,{"$f":"IF(OR(B78=Help!E$18,B78=\"\"),\"\",B78+1)","v":""},"","","","","","","","","",""]
[null,{"$f":"IF(OR(B79=Help!E$18,B79=\"\"),\"\",B79+1)","v":""},"","","","","","","","","",""]

{"sheet":"Help","index":17,"n_rows":40,"n_cols":8,"rows_kept":40,"cut":false,"hidden":true,"merged":[]}
[]
[]
["Urlaubstage zählen"]
[]
[null,"Monat","Name","von","bis","genutzte Urlaubstage","Wiederh. Monat"]
[null,1,{"$f":"TEXT(DATE(Jahr_Freigabe,B6,1),\"[$-de-DE]MMMM\")","v":"Januar"},0,{"$f":"INDIRECT(F6)","v":0},{"$f":"C6&\"!\"&F$18","v":"Januar!V41"},{"$f":"C6","v":"Januar"}]
[null,2,"Februar",{"$f":"E6","v":0},0,"Februar!V41","Februar"]
[null,3,"März",0,0,"März!V41","März"]
[null,4,"April",0,0,"April!V41","April"]
[null,5,"Mai",0,0,"Mai!V41","Mai"]
[null,6,"Juni",0,0,"Juni!V41","Juni"]
[null,7,"Juli",0,0,"Juli!V41","Juli"]
[null,8,"August",0,0,"August!V41","August"]
[null,9,"September",0,0,"September!V41","September"]
[null,10,"Oktober",0,0,"Oktober!V41","Oktober"]
[null,11,"November",0,0,"November!V41","November"]
[null,12,"Dezember",0,0,"Dezember!V41","Dezember"]
[null,null,"Werte_UrlaubstageProMonat",null,{"$f":"E17","v":0},"V41"]
[]
[null,60,"Wert_Zeilenzahl_Urlaubstage"]
[]
[]
["Gleitzeittage, Urlaubstage, Krankheitstage zählen für Anzeige auf den Monatsblättern (rechts unten)"]
[]
[null,null,"Ganztägige Zeitentnahme",null,"Urlaub",null,"Krankheit"]
[null,null,"Monat","Aufsummiert","Monat","Aufsummiert","Monat","Aufsummiert"]
[null,null,"GT",0,"U",0,"K",0]
[null,{"$f":"Feiertage!L11","v":"Januar"},{"$f":"COUNTIF(INDIRECT($B28&\"!U$10:U$40\"),\"=\"&C$27)","v":0},{"$f":"D27+C28","v":0},{"$f":"COUNTIF(INDIRECT($B28&\"!U$10:U$40\"),\"=\"&E$27)","v":0},{"$f":"F27+E28","v":0},{"$f":"COUNTIF(INDIRECT($B28&\"!U$10:U$40\"),\"=\"&G$27)","v":0},{"$f":"H27+G28","v":0}]
[null,{"$f":"Feiertage!L12","v":"Februar"},0,{"$f":"D28+C29","v":0},0,{"$f":"F28+E29","v":0},0,{"$f":"H28+G29","v":0}]
[null,{"$f":"Feiertage!L13","v":"März"},0,0,0,0,0,0]
[null,{"$f":"Feiertage!L14","v":"April"},0,0,0,0,0,0]
[null,{"$f":"Feiertage!L15","v":"Mai"},0,0,0,0,0,0]
[null,{"$f":"Feiertage!L16","v":"Juni"},0,0,0,0,0,0]
[null,{"$f":"Feiertage!L17","v":"Juli"},0,0,0,0,0,0]
[null,{"$f":"Feiertage!L18","v":"August"},0,0,0,0,0,0]
[null,{"$f":"Feiertage!L19","v":"September"},0,0,0,0,0,0]
[null,{"$f":"Feiertage!L20","v":"Oktober"},0,0,0,0,0,0]
[null,{"$f":"Feiertage!L21","v":"November"},0,0,0,0,0,0]
[null,{"$f":"Feiertage!L22","v":"Dezember"},0,0,0,0,0,0]
[null,null,{"$f":"COLUMN(C40)-COLUMN($B40)+1","v":2},{"$f":"COLUMN(D40)-COLUMN($B40)+1","v":3},4,5,6,7]

{"sheet":"Historie","index":18,"n_rows":48,"n_cols":4,"rows_kept":48,"cut":false,"hidden":true,"merged":[]}
["Änderungsnotizen"]
[]
["Freigabe","Version","Name bzw. Änderungen"]
["2019-03-13","2023.01",{"$f":"IF(AND(A4=\"\",D4<>\"\"),\"l\",\"\")","v":""},"Florian Kreitmaier, SE CYS BP CE"]
[null,null,{"$f":"IF(AND(A5=\"\",D5<>\"\"),\"l\",\"\")","v":"l"},"Fehler in der Berechnung der Urlaubstage korrigiert"]
[null,null,"l","Berechnung der mobile Work / Home Office Tage"]
[null,null,"l","draft Version einer Anwesenheitsstatistik im Büro"]
[null,null,"l","Aufnahme der optionalen mobile Work Statistik in den Bericht FK Bericht"]
["2017-01-03","2021.01",{"$f":"IF(AND(A9=\"\",D9<>\"\"),\"l\",\"\")","v":""},"Inga Hinrichs, HR IE OE DE ST"]
[null,null,{"$f":"IF(AND(A10=\"\",D10<>\"\"),\"l\",\"\")","v":"l"},"Anpassungen für 2021"]
[null,null,"l","div. kleinere Verbesserungen im Admin-Teil, z.B.\n- Historie in eigenes Register\n- Verbesserung der Blattschutz-Subroutine"]
[null,null,"l","Anzeige von Urlaubs- und Krankheitstagen beim Monatsblatt (rechts unten)\n(dazu notwenig: Alle Monatsblätter auf 31 Tage ergänzt, Zeilen ausgeblendet)"]
[null,null,"l","Passwort beim Blattschutz (steht im Makro Go_Blattschutz im Klartext)"]
[null,null,"l","Auf Monatsseiten, etc. Grid und Zeilen-/Spaltenköpfe ausgeblendet"]
[null,null,"l","Einfügen eines Blockes mit \"täglicher Arbeitszeit\" analog zur Teilzeit-Datei"]
[null,null,"l","Korrektur Feiertage und Texte im Dezember bzgl. Betriebsschließung 24./31.12."]
["2015-12-29",null,"","Inga Hinrichs, HR IE DE BP"]
[null,null,"l","Anpassungen für 2020"]
[null,null,"l","Darstellung Wochentage für englisches Betriebssystem (Format-Kürzel \"T\" funktioniert nicht auf englischem, \"D\" nicht auf deutschem BS); dito Monatsnamen"]
["2015-03-30",null,"","Inga Hinrichs, HR IE BP-CCS"]
[null,null,"l","Eingabefelder (Name, etc.)  farbig"]
[null,null,"l","div. kleinere Korrekturen"]
["2014-12-20",null,"","Inga Hinrichs, HR IE BP-CCS"]
[null,null,"l","Freigabe für 2019"]
["xx.12.2017",null,"","Inga Hinrichs, HR IE BP-CCS"]
[null,null,"l","Freigabe für 2018"]
["2013-01-03",null,"","Inga Hinrichs, HR IE BP-CCS"]
[null,null,"l","Freigabe für 2017"]
[null,null,"l","Formeln \"Zelle\" auf Englisch, da Excel bei diesem Befehl keine Sprachumsetzung macht"]
[null,null,"l","Farbige Markierung von nicht ausgefüllten Zeilen (in Teilzeit-Version ein-, in Vollzeit-Version ausgeschaltet)"]
["10/2016",null,"","Inga Hinrichs, HR BP CSS"]
[null,null,"l","Korrektur für Eingabe der wöchentlichen Arbeitszeit < 24:00 h"]
["5/2016",null,"","Inga Hinrichs, HR BP CSS"]
[null,null,"l","Eingabemöglichkeit für die Wochenstundenzahl wahlweise im Format Stunden:Minuten oder \"Industrieminuten\", d.h. Stunden, Zehntel-Stunden"]
[null,null,"l","Bei Änderung der persönlichen Daten (z.B. Nachname, Wochenarbeitszeit): Weitergabe an Folgemonate auch unterjährig"]
[null,null,"l","div. Korrekturen der bedingten Formatierungen"]
[null,null,"l","Warnhinweis bei Änderung des Jahres im Januar"]
[null,null,"l","teilweise Angleichung der Datei-Versionen für Teilzeit- und Vollzeitkräfte"]
["1/2016",null,"","Inga Hinrichs, HR BP CSS"]
[null,null,"l","Fehlerkorrektur bei Eintrag in Spalte F"]
["12/2015",null,"","Inga Hinrichs, HR BP CSS"]
[null,null,"l","Version für 2016 vorbereiten"]
[null,null,"l","Spalte Abwesenheit (Spalte M) mit Auswahlliste, ignorieren von Kleinschreibung und Leerzeichen"]
["2010-01-09",null,"","Inga Hinrichs, HR CU SP"]
[null,null,"l","Größe der gelben Kommentarfelder angepasst, damit Texte vollständig lesbar sind"]
[null,null,"l","Drucken auf Standarddrucker ersetzt durch Aufruf Druckmenü"]
[null,null,"l","Änderungsnotizen eingeführt"]
[null,null,"l","Makros erweitert:\n- Blattschutz überall aus (für Änderungen)\n- alle Blätter auf definierten Anfangszustand setzten und Blattschutz ein "]